program: Gaussian 09
title: 000274299
version: EM64L-G09RevD.01
frameworkgroup: C1[X(C12H8N6O2S2)]
method: RPBEPBE
basis: SDD
operation: Freq
keyword: #p
keyword: freq=noraman
keyword: PBEPBE/SDD
title: #p freq=noraman PBEPBE/SDD
converged: YES YES NO NO
title: Mulliken charges:
elementType: S S O O N N N N N N C C C C C C C C C C C C H H H H H H H H
charge: 0.262751 0.262738 -0.275161 -0.275060 -0.064605 -0.064648 -0.211515 -0.211541 -0.616424 -0.616416 0.488537 0.488545 -0.378463 -0.342609 -0.342489 -0.378545 -0.449735 -0.449744 0.160706 0.160862 0.175899 0.175694 0.247611 0.300715 0.300830 0.247611 0.362909 0.339321 0.362920 0.339308
chargesum: 0.00000
title: Mulliken charges with hydrogens summed into heavy atoms:
elementType: S S O O N N N N N N C C C C C C C C C C C C
charge: 0.262751 0.262738 -0.275161 -0.275060 -0.064605 -0.064648 -0.211515 -0.211541 0.085805 0.085812 0.488537 0.488545 -0.130853 -0.041894 -0.041659 -0.130934 -0.449735 -0.449744 0.160706 0.160862 0.175899 0.175694
polarizability: 4.29565115e+02 1.23207126e+01 2.08561526e+02 -1.07126471e-02 5.61864984e-03 1.20772819e+02
1716.lowfreq: -4.6753 -0.0008 0.0012 0.0013 1.7306 4.2137 7.1494 7.8398 30.3931
frequency: 5.2242 6.7547 30.3776 43.6732 46.5327 74.7279 113.2780 113.8241 152.1501 154.9945 186.4049 216.5234 222.7106 249.1430 309.7271 334.2706 341.3743 351.6060 380.1599 391.6674 393.6944 404.5210 406.8001 474.2613 510.5670 527.7647 542.9893 550.3587 561.7965 577.8655 587.7496 590.5361 628.2379 628.3636 632.5577 645.2210 647.1460 677.0665 732.3820 741.8481 747.4584 758.2223 761.9531 823.6054 840.3115 873.3331 894.0248 936.1387 938.7947 964.7003 967.5314 1017.6666 1065.0311 1065.1175 1141.5700 1163.6256 1169.4890 1213.6553 1224.5577 1234.4041 1327.9085 1330.1310 1337.6862 1359.6363 1401.6791 1403.2589 1416.3902 1442.2809 1451.6594 1508.0537 1539.1515 1564.0849 1564.6416 1608.1128 1626.6397 1627.7633 3137.6551 3139.3703 3193.8201 3196.1483 3506.4311 3506.5808 3669.2514 3669.2823
redmass: 6.6301 8.2673 7.1193 5.1899 8.2352 8.6671 10.7758 11.1559 8.3620 10.0599 10.8233 7.5183 6.5016 7.6986 8.0564 11.3151 6.1037 6.5298 7.1566 9.5916 3.6017 5.4101 8.0907 5.1320 7.3089 9.2587 4.9762 2.0925 1.9637 2.7466 3.3307 3.4590 1.1300 1.1650 4.7178 2.9599 3.1635 7.2456 5.9257 5.9213 8.9973 10.3196 8.8773 1.2650 1.8738 8.6263 6.7317 8.5961 7.0657 1.4705 1.4048 2.8994 1.8965 1.9198 1.7216 10.9524 5.6541 3.0310 3.1062 1.3897 2.3254 4.1923 1.9036 5.0442 10.2504 11.7832 3.3267 4.3658 9.5894 3.0039 6.2246 1.4697 1.5139 5.6594 3.6958 3.6954 1.0911 1.0910 1.0941 1.0951 1.0454 1.0454 1.1046 1.1046
irintensity: 2.2856 1.2711 4.3082 1.4102 8.5864 0.9646 2.8392 3.9423 0.4981 1.0261 0.1670 5.5836 23.4642 1.6441 0.6552 19.7945 7.1006 4.6788 1.7052 18.7290 0.3263 0.4383 14.3718 8.0836 1.0827 2.8617 13.3221 67.1671 14.5676 50.2691 21.2391 61.6790 81.4096 250.0095 1.5362 28.1590 48.6106 12.7704 33.8507 6.6092 0.2563 26.7117 5.2942 33.0839 79.0033 20.1699 0.3855 1.2871 46.2303 14.3972 0.0508 0.6837 3.7471 0.6281 17.8872 0.0319 0.6326 6.2072 163.5253 0.1163 31.1933 80.7640 16.1441 31.6321 416.5671 49.7838 78.6293 306.2566 25.9232 24.1314 0.1211 258.6100 96.7515 1.0800 611.2768 3.9701 9.3660 0.4948 34.9127 5.0444 146.2750 9.2296 82.2832 42.2285
temp: 298.150 k
press: 1.00000 atm
elementType: 16 16 8 8 7 7 7 7 7 7 6 6 6 6 6 6 6 6 6 6 6 6 1 1 1 1 1 1 1 1
symmnumber: 1
zpe: 511497.2 jmol-1
zpe.correction: 0.194819 hartree
zpe.thermalcorrener: 0.214538 hartree
zpe.thermalcorrenthalpy: 0.215482 hartree
zpe.thermalcorrgfe: 0.141109 hartree
zpe.sumelectzpe: -1735.596138 hartree
zpe.sumelectthermal: -1735.576419 hartree
zpe.sumelectthermalent: -1735.575475 hartree
zpe.sumelectthermalfe: -1735.649847 hartree
dipole: -0.0020 0.0023 0.9519
dipole: 0.9519
quadrupole: -124.8318 -141.3918 -140.3836
quadrupole: -18.8688 -0.0059 0.0144
quadrupole: 10.7039 -5.8560 -4.8479 -18.8688 -0.0059 0.0144
hfenergy: -1735.7909567 hartree
pointgroup: C01 [X(C12H8N6O2S2)]
dipole: -0.0008085 -0.3744975 0.0009111 debye
polarizability: 427.249018|0.0283042|120.7728213|25.6573757|0.0065392|210.877621 unknown
InChI: InChI=1S/C12H8N6O2S2/c13-11(19)7-9(21-17-15-7)5-1-2-6(4-3-5)10-8(12(14)20)16-18-22-10/h1-4H,13-14H2
charge 0 multiplicity 1
30 atoms
S  -3.288664 1.128848 -2.171394
S  3.287501 1.129926 2.170651
O  -3.204717 -1.269662 2.081635
O  3.206277 -1.270968 -2.081446
N  -5.179394 0.010561 -0.711324
N  5.179067 0.011869 0.711564
N  -5.168112 0.662327 -1.812303
N  5.16725 0.664198 1.812201
N  -5.413092 -1.552012 1.426296
N  5.414441 -1.551562 -1.424788
C  -1.405425 0.226442 -0.30153
C  1.405078 0.226673 0.300586
C  -0.422717 0.226598 -1.336359
C  0.950917 0.218549 -1.049711
C  -0.951275 0.218124 1.048758
C  0.422354 0.226463 1.335403
C  -2.836793 0.279938 -0.656883
C  2.836393 0.280591 0.656148
C  -3.988153 -0.236805 -0.009255
C  3.988149 -0.236226 0.009202
C  -4.138519 -1.052123 1.249972
C  4.139454 -1.052435 -1.249345
H  -0.739455 0.207239 -2.385219
H  1.676139 0.176321 -1.863262
H  -1.67651 0.175503 1.862292
H  0.739095 0.206996 2.384261
H  -6.154067 -1.345159 0.755635
H  -5.598933 -2.107146 2.26004
H  6.154964 -1.343801 -0.753908
H  5.601049 -2.107067 -2.258114
