program: Gaussian 09
title: 000026395
version: EM64L-G09RevD.01
frameworkgroup: C1[X(C14H20N2O)]
method: RPBEPBE
basis: SDD
operation: Freq
keyword: #p
keyword: freq=noraman
keyword: PBEPBE/SDD
title: #p freq=noraman PBEPBE/SDD
converged: YES YES NO NO
title: Mulliken charges:
elementType: O N N C C C C C C C C C C C C C C H H H H H H H H H H H H H H H H H H H H
charge: -0.445203 -0.102889 -0.404091 -0.367344 -0.565581 0.406533 0.154230 -0.318707 -0.321300 0.216641 -0.445278 -0.595368 -0.676729 -0.673352 -0.316223 0.278560 -0.350008 0.207648 0.213637 0.202922 0.226869 0.185002 0.201590 0.186722 0.202446 0.268276 0.302389 0.223058 0.228785 0.207888 0.204548 0.226866 0.209338 0.205162 0.228079 0.247260 0.347624
chargesum: 0.00000
title: Mulliken charges with hydrogens summed into heavy atoms:
elementType: O N N C C C C C C C C C C C C C C
charge: -0.097579 -0.102889 -0.101702 0.053942 -0.135790 0.406533 0.154230 0.067884 0.067869 0.216641 -0.177003 -0.372310 -0.035508 -0.031987 -0.088144 0.278560 -0.102748
polarizability: 2.11154406e+02 7.20032144e+00 1.93294339e+02 1.42817001e+01 6.85234488e+00 1.09951974e+02
1716.lowfreq: -1.4600 -0.0008 -0.0006 0.0005 9.1635 10.7182 19.7186 31.3024 52.0969
frequency: 19.6495 31.2756 52.0899 80.9124 84.7607 91.4780 144.9935 163.2766 180.0894 200.2922 221.8696 250.9459 288.2744 292.5281 321.7213 329.0580 354.3338 372.1280 413.0281 423.3000 441.3668 444.7957 475.3803 487.0562 496.3138 582.6926 594.1964 643.5002 693.7261 738.2178 743.8582 767.3923 779.2435 793.3787 798.1054 802.2053 806.1680 822.6288 831.7996 911.8158 922.6929 930.0894 983.9554 1009.7596 1029.5568 1056.0037 1070.1693 1074.5781 1085.0515 1093.4517 1104.6511 1119.9446 1144.1475 1150.8241 1203.2985 1205.9458 1222.7903 1242.6482 1251.7207 1275.4827 1284.3971 1289.9425 1299.2916 1314.3447 1337.3812 1358.9890 1360.7866 1373.5783 1388.0405 1388.4791 1395.2193 1440.4085 1459.9055 1462.7435 1463.9472 1468.4981 1471.2986 1478.6706 1481.1002 1484.7748 1487.3251 1491.3758 1563.0262 1601.4904 1636.6102 2843.1463 2852.7882 2872.3517 2976.2111 2982.8817 2983.3534 3020.0650 3031.5295 3037.4960 3057.4217 3074.4765 3076.1758 3090.9742 3092.1794 3113.0959 3136.2765 3173.7865 3218.5991 3584.9303 3617.3126
redmass: 3.5807 4.3899 3.5493 2.4594 2.7277 2.0920 4.6925 1.9833 2.2086 1.8346 1.6796 1.8121 2.8545 2.0142 2.0637 1.4520 4.1645 3.7439 3.6402 2.8536 3.8748 3.6192 1.7847 1.6876 3.5075 3.5302 3.1773 3.6356 4.7425 3.1071 3.3613 2.2491 1.4884 1.3385 1.1451 1.5627 1.6598 2.7302 1.9021 1.9565 4.0988 1.3283 2.3932 1.8333 3.4546 2.4481 2.4885 2.0244 2.1145 1.5900 1.6452 1.5172 1.3283 1.5095 2.2231 1.8140 1.6882 2.7503 1.4668 1.1877 1.2339 1.2836 1.6391 1.8119 1.8625 1.3313 1.3293 1.3848 1.2323 1.2314 4.3943 3.0000 1.1097 1.0852 3.2231 1.0934 1.0588 1.0812 3.8709 1.0780 1.0680 1.0741 6.0971 6.2290 7.2594 1.0721 1.0718 1.0711 1.0645 1.0357 1.0359 1.0866 1.0869 1.0886 1.0967 1.0985 1.0979 1.1004 1.1002 1.0912 1.0896 1.0954 1.0982 1.0659 1.0809
irintensity: 0.3193 0.2802 0.1564 0.1832 0.3395 0.0802 3.7728 0.8591 1.2844 0.9134 0.1990 0.5891 1.0164 0.6694 19.0488 113.5326 16.8292 0.5297 7.5279 15.6316 5.4694 0.9018 31.5498 72.7789 12.7477 14.3688 12.2045 11.7166 18.3401 1.3134 0.3235 4.6551 3.9269 50.5786 8.8617 17.8136 2.3451 17.0076 26.6495 1.6106 24.7909 0.1380 4.7426 15.5704 1.6297 12.9269 51.4191 14.0719 3.0428 28.2896 64.2590 87.2831 122.3214 19.8160 24.9940 13.5301 22.0309 15.9589 7.2026 1.1292 7.9883 16.1026 10.0873 7.9178 15.6138 8.6291 6.2166 1.1086 24.1809 21.1068 20.9435 11.4358 5.8132 9.1954 42.3099 0.4079 1.3269 7.4347 63.1276 12.1083 11.9437 13.6025 1.1898 21.1810 29.4329 38.6856 101.5043 146.4645 37.4892 39.2015 28.8067 22.1857 21.0741 11.2289 35.4055 37.7505 82.2118 39.1807 44.4908 18.7263 11.3959 8.9078 1.2071 26.3156 62.4335
temp: 298.150 k
press: 1.00000 atm
elementType: 8 7 7 6 6 6 6 6 6 6 6 6 6 6 6 6 6 1 1 1 1 1 1 1 1 1 1 1 1 1 1 1 1 1 1 1 1
symmnumber: 1
zpe: 824007.4 jmol-1
zpe.correction: 0.313848 hartree
zpe.thermalcorrener: 0.331330 hartree
zpe.thermalcorrenthalpy: 0.332274 hartree
zpe.thermalcorrgfe: 0.267378 hartree
zpe.sumelectzpe: -728.913505 hartree
zpe.sumelectthermal: -728.896022 hartree
zpe.sumelectthermalent: -728.895078 hartree
zpe.sumelectthermalfe: -728.959975 hartree
dipole: -1.0484 -1.7379 0.1506
dipole: 2.0352
quadrupole: -104.1836 -88.0741 -108.0579
quadrupole: -15.1884 -2.5372 -0.6732
quadrupole: -4.0784 12.0311 -7.9527 -15.1884 -2.5372 -0.6732
hfenergy: -729.2273527 hartree
pointgroup: C01 [X(C14H20N2O1)]
dipole: 0.4144026 -0.6749383 -0.1177516 debye
polarizability: 212.0205429|-8.0376909|193.7102912|10.6700709|-0.840427|108.6698852 unknown
InChI: InChI=1S/C14H20N2O/c1-3-16(4-2)8-7-11-10-15-14-6-5-12(17)9-13(11)14/h5-6,9-10,15,17H,3-4,7-8H2,1-2H3
charge 0 multiplicity 1
37 atoms
O  -3.14216 3.035678 -0.223235
N  3.218706 0.228731 -0.146911
N  -2.179941 -2.450083 0.215373
C  1.836166 -0.233468 -0.437463
C  1.093285 -0.717261 0.838932
C  -0.327476 -1.14598 0.565018
C  -1.4602 -0.281799 0.273678
C  3.249647 1.620926 0.378601
C  4.148492 0.025052 -1.291369
C  -2.607278 -1.124227 0.05948
C  -0.811046 -2.455709 0.519665
C  -1.612058 1.129727 0.183987
C  4.497546 1.918361 1.232097
C  4.573933 -1.446046 -1.461896
C  -3.882338 -0.595434 -0.241048
C  -2.886864 1.648465 -0.113374
C  -4.013928 0.801877 -0.327093
H  1.232791 0.560329 -0.944635
H  1.885778 -1.08074 -1.14412
H  1.103062 0.094772 1.593507
H  1.677507 -1.549207 1.272299
H  3.168936 2.371041 -0.450486
H  2.353773 1.760943 1.012171
H  3.707909 0.40587 -2.248407
H  5.054243 0.629985 -1.102883
H  -0.276767 -3.389416 0.68848
H  -2.770555 -3.273896 0.133998
H  -0.755652 1.797537 0.345853
H  4.552001 1.213454 2.079839
H  5.430813 1.82019 0.648637
H  4.459124 2.950442 1.628621
H  5.068945 -1.805398 -0.542915
H  3.709017 -2.10435 -1.661696
H  5.277007 -1.550385 -2.30964
H  -4.751503 -1.24217 -0.403824
H  -4.975995 1.268905 -0.55646
H  -2.315022 3.552384 -0.05918
