program: Gaussian 09
title: 000274277
version: EM64L-G09RevD.01
frameworkgroup: C1[X(C11H8N2O5)]
method: RPBEPBE
basis: SDD
operation: Freq
keyword: #p
keyword: freq=noraman
keyword: PBEPBE/SDD
title: #p freq=noraman PBEPBE/SDD
converged: YES YES NO NO
title: Mulliken charges:
elementType: O O O O O N N C C C C C C C C C C C H H H H H H H H
charge: -0.247367 -0.438312 -0.250828 -0.155192 -0.203788 0.043038 0.007793 0.359959 -0.225036 0.397740 0.162930 -0.537438 0.362889 -0.520016 -0.250570 -0.372786 0.135803 -0.536161 0.328217 0.290909 0.281234 0.256005 0.256234 0.232809 0.229456 0.392480
chargesum: 0.00000
title: Mulliken charges with hydrogens summed into heavy atoms:
elementType: O O O O O N N C C C C C C C C C C C
charge: -0.247367 -0.045832 -0.250828 -0.155192 -0.203788 0.043038 0.007793 0.359959 -0.225036 0.397740 0.162930 -0.209221 0.362889 -0.229107 0.030663 -0.116780 0.135803 0.182337
polarizability: 2.31005163e+02 1.99872974e+01 1.98718295e+02 -3.52965793e+00 -1.23303776e+00 7.13417338e+01
1716.lowfreq: -0.0007 -0.0005 0.0003 3.9975 6.5569 8.9466 42.2974 44.4194 58.8659
frequency: 42.2923 44.4187 58.8602 82.0208 133.3758 144.1634 147.7059 170.5770 194.1894 227.8056 231.9550 303.1684 309.6505 321.4330 364.6838 378.2608 424.0114 452.8579 485.5725 530.4191 542.5771 565.9355 596.2711 598.5335 631.3290 649.2095 687.9576 699.4187 745.3593 751.5029 804.8744 812.2352 859.6623 879.8642 892.5906 897.8936 941.4129 984.8804 989.3408 1018.7196 1075.0874 1087.4912 1111.0616 1153.4483 1168.4372 1208.3271 1222.2209 1227.2734 1260.8674 1310.1198 1332.6296 1358.2686 1372.3213 1382.6934 1428.0211 1437.9094 1457.1012 1470.1814 1472.5109 1494.0772 1545.1277 1565.2583 1623.9014 1635.8637 2972.2508 3066.2856 3138.1125 3143.9063 3181.6467 3187.4696 3193.6277 3532.2550
redmass: 10.4503 9.9330 10.7772 3.5662 5.6310 6.9721 5.5430 5.3461 2.9637 5.1994 1.4927 5.1976 4.3162 7.3117 6.6799 10.1689 7.9839 5.1953 5.1114 5.0398 4.8832 6.4990 4.5030 1.4163 5.3128 2.6715 6.9711 11.1718 6.0316 6.4633 5.6567 4.4584 7.2073 1.4019 1.9675 4.9419 1.5180 1.4632 6.6198 4.0204 2.1124 2.6469 1.2560 1.4033 2.0084 2.5871 2.1100 3.0895 3.3262 2.1121 6.2826 4.0536 2.5047 9.0218 2.1142 1.9443 2.4181 1.0793 1.0489 4.7021 7.4101 7.3173 6.9216 8.9891 1.0327 1.1048 1.1002 1.0913 1.0918 1.0925 1.0945 1.0643
irintensity: 1.0684 2.2502 1.3754 3.9826 0.6344 3.4594 4.2570 1.0308 3.0036 2.0613 0.4805 2.1650 5.9195 5.2155 4.0549 1.8837 0.4925 6.1166 1.4734 3.9928 1.7954 15.8790 87.1159 126.2238 6.7402 17.5025 5.3474 29.3432 27.4250 10.5109 2.9884 1.9069 6.8179 32.6195 10.3484 4.8441 31.4663 4.9664 273.3868 16.3831 214.3069 18.7008 0.1182 6.0224 141.7570 49.3552 150.6878 71.0899 199.9915 79.5342 6.4962 27.1162 23.3383 101.4839 26.1023 6.5426 22.2220 48.2126 16.2013 152.7342 19.5205 33.8905 110.4197 220.8356 63.9597 36.4508 17.2182 15.4205 0.6350 21.9314 1.2367 70.3270
temp: 298.150 k
press: 1.00000 atm
elementType: 8 8 8 8 8 7 7 6 6 6 6 6 6 6 6 6 6 6 1 1 1 1 1 1 1 1
symmnumber: 1
zpe: 469012.4 jmol-1
zpe.correction: 0.178637 hartree
zpe.thermalcorrener: 0.194023 hartree
zpe.thermalcorrenthalpy: 0.194968 hartree
zpe.thermalcorrgfe: 0.135012 hartree
zpe.sumelectzpe: -908.221924 hartree
zpe.sumelectthermal: -908.206537 hartree
zpe.sumelectthermalent: -908.205593 hartree
zpe.sumelectthermalfe: -908.265549 hartree
dipole: -2.7134 3.6212 -0.0584
dipole: 4.5254
quadrupole: -88.3447 -107.0294 -104.8093
quadrupole: 24.9833 2.0565 1.5031
quadrupole: 11.7164 -6.9682 -4.7482 24.9833 2.0565 1.5031
hfenergy: -908.4005609 hartree
pointgroup: C01 [X(C11H8N2O5)]
dipole: 1.113026 -1.3893998 -0.0246039 debye
dipolederiv: -0.6974824 -0.5586418 -0.0482406 -1.0265804 -1.5315105 -0.1213202 -0.0653085 -0.0971411 -0.2998341 -1.5074924 -0.2535818 -0.0836468 -0.3366831 -0.3169077 -0.0225655 -0.0862927 -0.0158272 -0.4265565 -0.7412582 0.1462232 -0.0297768 0.1531037 -0.8879338 0.0070878 -0.0316186 0.007444 -0.3143713 -0.3922539 0.1966881 -0.0183676 0.2129807 -0.5325231 -0.2650887 -0.1194101 -0.1864589 -0.4864277 -0.7808792 0.130741 -0.288907 0.1496754 -0.3511064 -0.081506 -0.2309617 -0.0926744 -0.498751 0.0041703 0.0588076 0.0028534 0.2920575 -0.0792285 0.033151 0.0289266 0.0296689 -0.1708712 1.1762016 -0.4853511 0.3700219 -0.677828 0.8117816 0.3890388 0.3574639 0.28747 0.8002863 -0.0041115 0.024512 0.0030714 0.5586004 0.1811717 0.0493896 -0.0080648 0.0183235 0.0692426 0.0907543 0.1414468 -0.02481 -0.215176 -0.2971708 -0.0454623 0.0623026 -0.0728663 0.0128608 0.127958 0.1851218 -0.0319622 0.5156578 0.0420631 -0.0342011 0.0233798 -0.022859 0.02254 -0.3622291 0.1295173 -0.0329216 0.5298069 -0.1774746 0.0367472 -0.0316228 0.0078554 0.0041332 -0.3259253 -0.4005399 -0.0211199 -0.2388976 -0.3070602 -0.0285409 -0.0285275 -0.0452512 -0.1480218 0.0253943 0.3702343 0.0051404 0.9624526 1.6177649 0.1307809 0.0091492 0.1043673 0.1198537 0.0558523 0.1600604 0.0337214 -0.5406582 -0.395275 -0.046064 -0.0715858 0.072397 -0.1380443 0.1414697 0.1261446 0.0115315 -0.4288686 -0.2134319 -0.0238325 0.0394491 0.027615 -0.0380172 -0.3425694 -0.1800812 -0.0182204 0.1036852 0.4468318 -0.0042298 -0.0241389 -0.0180553 -0.0628675 2.1177439 -0.0920499 0.1412906 -0.3054115 1.1505941 -0.0145503 0.1288146 -0.0026593 0.2349765 0.777587 0.5416043 0.0513193 0.2291885 0.419704 0.0227297 0.0501829 0.0562463 0.316155 0.1988717 0.0387009 0.0033241 -0.0196156 0.0897191 -0.0013545 0.0179328 -0.0054951 0.1739098 0.02516 -0.0336018 -0.0078217 -0.0211994 0.1228399 0.0048626 -0.0028652 -0.0284799 0.1584869 0.0295052 -0.0422277 -0.0085843 -0.050388 0.1199042 -0.0027042 -0.0077004 -0.0035213 0.1536364 0.0534032 -0.0486679 -0.0022517 -0.0564854 -0.0814323 0.0028673 -0.0147761 -0.0024686 0.1300434 0.079599 -0.0006076 -0.0033727 -0.0607441 -0.1312135 -0.0175214 -0.0065727 -0.0126019 0.1274829 -0.0583315 -0.0996582 -0.061704 0.0755231 0.0718381 0.1104301 -0.0907746 0.0415244 -0.0750483 -0.0922134 -0.0991247 0.0591007 0.0825962 0.0846467 -0.0835166 0.0995182 -0.0461895 -0.0666132 0.4010759 0.0443313 0.0003326 0.1132079 0.1434092 0.0053729 0.0031009 -0.0003628 0.4018164 unknown
polarizability: 228.4639888|20.0624931|199.3815091|15.2184639|9.7677102|73.2196935 unknown
InChI: InChI=1S/C11H8N2O5/c1-18-6-4-8-7(11(14)15)2-3-12-10(8)9(5-6)13(16)17/h2-5,14H,1H3
charge 0 multiplicity 1
26 atoms
O  -1.361489 -3.193707 -0.143045
O  4.48448 -0.087069 0.384635
O  3.157816 -1.976552 0.262973
O  -2.665481 2.459587 0.93119
O  -3.687418 1.395385 -0.813558
N  0.053052 2.25042 0.06849
N  -2.723401 1.538654 0.039994
C  0.72718 -0.162827 0.122338
C  -0.264379 0.907463 0.084945
C  -1.644514 0.51921 0.006554
C  2.11478 0.257875 0.214189
C  0.30262 -1.519531 0.056626
C  -1.059783 -1.836988 -0.066191
C  -2.050206 -0.80827 -0.101597
C  2.407529 1.630013 0.231485
C  1.353972 2.586463 0.138453
C  3.237021 -0.723446 0.284058
C  -2.768879 -3.590071 -0.297858
H  1.036168 -2.327165 0.091997
H  -3.115835 -1.027069 -0.203856
H  3.445185 1.962206 0.301818
H  1.579841 3.657891 0.116349
H  -2.746643 -4.687549 -0.349006
H  -3.199181 -3.180742 -1.231186
H  -3.37308 -3.269096 0.571611
H  5.192743 -0.783984 0.429393
