program: Gaussian 09
title: 000274284
version: EM64L-G09RevD.01
frameworkgroup: C1[X(C16H22N2O4)]
method: RPBEPBE
basis: SDD
operation: Freq
keyword: #p
keyword: freq=noraman
keyword: PBEPBE/SDD
title: #p freq=noraman PBEPBE/SDD
converged: YES YES NO NO
title: Mulliken charges:
elementType: O O O O N N C C C C C C C C C C C C C C C C H H H H H H H H H H H H H H H H H H H H H H
charge: -0.294418 -0.247262 -0.201380 -0.202262 -0.360112 0.027424 0.011331 -0.401905 -0.460961 -0.395201 -0.395957 -0.387299 -0.405192 0.026809 -0.702064 0.190576 0.231148 -0.320850 -0.314027 -0.352173 -0.345109 0.387454 0.179847 0.202976 0.191307 0.186623 0.208953 0.200528 0.191776 0.201382 0.194459 0.199307 0.192257 0.253633 0.237079 0.209453 0.230820 0.246344 0.214505 0.225516 0.282185 0.282362 0.290852 0.289265
chargesum: 0.00000
title: Mulliken charges with hydrogens summed into heavy atoms:
elementType: O O O O N N C C C C C C C C C C C C C C C C
charge: -0.294418 -0.247262 -0.201380 -0.202262 -0.106479 0.027424 0.191178 -0.007622 -0.065385 -0.002897 -0.000116 0.004265 0.041340 0.257630 -0.015699 0.190576 0.231148 -0.038665 -0.031665 -0.061321 -0.055844 0.387454
polarizability: 3.15746934e+02 -1.47815189e+01 1.85688002e+02 2.15302163e+01 2.14372987e+01 1.46592703e+02
1716.lowfreq: -29.0980 -11.1612 -4.0689 0.0005 0.0008 0.0009 4.4529 14.3939 20.4966
frequency: -26.3940 14.2090 17.8808 34.3265 56.1762 60.3382 71.3429 84.5383 90.5072 144.1513 159.2888 185.0277 198.0187 212.6730 215.5898 249.7953 259.8529 284.3358 314.0428 322.5632 345.9600 393.7546 409.1209 410.3726 434.1057 449.7302 455.8594 473.7941 489.5121 498.8703 523.0135 574.7543 623.6911 652.2041 673.6957 680.5181 685.3567 764.3833 772.8565 779.1290 786.0174 802.8774 825.6706 843.4728 864.0109 878.1096 888.5833 889.9500 898.7975 916.6447 927.6972 964.2374 1004.0429 1004.8907 1011.7352 1036.8238 1041.3889 1050.6819 1054.4074 1066.3600 1074.3309 1089.0618 1108.2558 1111.4334 1128.5233 1144.1827 1151.3873 1155.8759 1174.6669 1200.1773 1214.0410 1234.8703 1240.5133 1244.0547 1253.3357 1257.5471 1290.5802 1295.3350 1309.0650 1313.8387 1332.8254 1337.0424 1338.1690 1341.1322 1344.4688 1360.1213 1367.2583 1373.4743 1387.0661 1405.3862 1413.7116 1458.6207 1461.6751 1463.3410 1464.6467 1467.5813 1469.9569 1471.8795 1474.2382 1477.4397 1480.8971 1587.1276 1608.8356 1616.0281 2841.5114 2907.7800 2959.2120 2965.2416 2969.2110 2969.4465 2976.0946 2993.6326 3017.1767 3020.3382 3029.5412 3030.1792 3035.7162 3045.4009 3049.4098 3094.4434 3104.8094 3164.9768 3175.9424 3188.0382 3193.6436 3422.4306
redmass: 3.1492 6.2580 4.6230 4.5732 3.9172 6.1897 5.3981 5.4722 7.6280 2.7651 3.2611 3.0310 3.6835 1.6072 1.5852 5.4889 3.5684 5.7366 4.7436 1.8638 3.4515 2.8870 3.4125 2.9230 3.0217 2.1942 3.7346 3.1908 7.7482 2.8432 4.1867 2.9787 7.1176 6.2575 1.3909 7.0502 3.8772 5.1332 8.8541 2.0262 1.6219 4.2557 5.1821 2.1125 1.2446 1.7153 1.6702 1.5848 2.3562 1.6850 1.5759 2.1146 1.5087 2.6157 1.3663 2.5051 2.0776 1.3017 1.5656 2.6060 1.8255 3.2514 1.3357 2.3092 2.1790 2.0196 2.2795 2.2556 1.2318 1.7600 6.9447 1.2873 1.3496 3.5411 1.2446 1.2405 1.2587 1.1913 1.3295 1.3045 1.3876 1.4967 1.4834 1.4693 1.4570 1.4207 7.7253 1.4222 1.2961 8.1763 4.5945 1.1290 1.1134 1.0901 1.0774 1.1458 1.0850 1.1086 2.2099 1.0944 1.0761 9.3126 6.5887 9.6379 1.0810 1.0699 1.0590 1.0629 1.0603 1.0664 1.0616 1.0358 1.0995 1.0853 1.0996 1.0951 1.1023 1.1029 1.0911 1.0996 1.0997 1.0900 1.0890 1.0958 1.0973 1.0741
irintensity: 0.1350 0.0629 0.5501 0.2230 0.1535 0.4006 0.0935 0.3091 5.0718 0.8655 4.6627 1.1362 5.8676 0.3027 2.3959 1.0230 1.2713 4.8954 2.3814 0.5153 0.9033 17.2830 2.2448 0.0815 2.2920 4.6714 4.3466 2.1079 5.0272 5.9391 2.4337 1.8457 0.4080 0.6480 60.0871 11.4246 69.9740 5.7511 31.7566 1.8957 0.1336 0.3076 21.9824 8.6318 0.5823 2.5652 52.1583 10.4712 6.8360 1.8655 1.3396 2.6071 8.4441 39.3369 0.0024 14.5164 160.2825 15.6387 27.7219 184.0132 10.7767 14.8822 10.5908 0.8727 111.9242 0.9144 31.1382 5.1022 3.3943 1.2018 535.8956 1.9085 1.9783 164.6593 2.4928 0.9297 0.2357 2.9879 3.1526 10.3930 1.6332 13.8420 0.8555 12.1791 0.6387 13.8752 85.2494 19.7252 22.7744 10.0246 63.2338 5.9405 4.0971 6.4037 1.1564 26.1088 33.1150 2.4693 4.9691 3.0311 3.3094 66.6638 12.1204 89.9817 70.6239 66.6445 42.9942 31.9234 36.5736 45.4264 23.7756 16.0060 55.7146 7.3371 42.2595 69.5828 3.3321 127.2436 25.7949 31.6134 13.9437 1.2454 1.0543 0.3887 0.4705 2.2373
temp: 298.150 k
press: 1.00000 atm
elementType: 8 8 8 8 7 7 6 6 6 6 6 6 6 6 6 6 6 6 6 6 6 6 1 1 1 1 1 1 1 1 1 1 1 1 1 1 1 1 1 1 1 1 1 1
symmnumber: 1
zpe: 947860.6 jmol-1
zpe.correction: 0.361021 hartree
zpe.thermalcorrener: 0.381752 hartree
zpe.thermalcorrenthalpy: 0.382696 hartree
zpe.thermalcorrgfe: 0.308508 hartree
zpe.sumelectzpe: -1031.556680 hartree
zpe.sumelectthermal: -1031.535949 hartree
zpe.sumelectthermalent: -1031.535005 hartree
zpe.sumelectthermalfe: -1031.609193 hartree
dipole: 5.8942 -0.0684 0.6139
dipole: 5.9264
quadrupole: -166.3809 -133.1371 -129.6897
quadrupole: 8.7884 -7.1957 1.7562
quadrupole: -23.3117 9.9322 13.3795 8.7884 -7.1957 1.7562
hfenergy: -1031.9177009 hartree
pointgroup: C01 [X(C16H22N2O4)]
dipole: -2.323259 -0.0541807 0.1899823 debye
polarizability: 318.766902|-9.2939142|150.801593|-7.5277822|-27.03304|178.4591438 unknown
InChI: InChI=1S/C16H22N2O4/c1-12(11-17-14-5-3-2-4-6-14)22-16(19)13-7-9-15(10-8-13)18(20)21/h7-10,12,14,17H,2-6,11H2,1H3
charge 0 multiplicity 1
44 atoms
O  0.360259 0.918131 0.794877
O  0.631624 1.958831 -1.281188
O  7.419411 0.058826 -1.008975
O  7.040399 -0.980111 0.985877
N  -3.277704 0.578966 -0.141683
N  6.6493 -0.294834 -0.035577
C  -4.2517 -0.510534 -0.420896
C  -4.586902 -1.310046 0.862992
C  -5.543926 0.101389 -1.010632
C  -5.638908 -2.409633 0.582585
C  -6.610919 -0.981946 -1.295474
C  -6.928286 -1.808927 -0.026472
C  -1.871072 0.171545 0.04358
C  -1.104308 1.280699 0.801642
C  -1.507188 1.419776 2.266144
C  1.102962 1.309929 -0.31293
C  2.534111 0.878092 -0.205078
C  3.417428 1.239708 -1.255235
C  3.010059 0.128326 0.901901
C  4.770591 0.859507 -1.206796
C  4.361402 -0.260165 0.962683
C  5.219839 0.113083 -0.094917
H  -3.845328 -1.232354 -1.176577
H  -4.973588 -0.594996 1.616617
H  -3.67074 -1.764452 1.288117
H  -5.305678 0.653687 -1.943503
H  -5.941267 0.840763 -0.285403
H  -5.873171 -2.953096 1.518113
H  -5.215376 -3.155607 -0.122024
H  -7.531961 -0.507597 -1.68538
H  -6.240361 -1.662148 -2.090136
H  -7.650655 -2.613019 -0.266291
H  -7.413371 -1.152506 0.7252
H  -3.354929 1.328928 -0.843821
H  -1.343177 -0.040705 -0.91511
H  -1.84189 -0.753037 0.647453
H  -1.204641 2.236759 0.253245
H  -2.598847 1.574376 2.312326
H  -1.257946 0.501676 2.827776
H  -0.998831 2.274301 2.744225
H  3.022135 1.817576 -2.096254
H  2.315517 -0.13981 1.701594
H  5.475642 1.123661 -1.998785
H  4.759688 -0.838011 1.800392
