program: Gaussian 09
title: 000274251
version: EM64L-G09RevD.01
frameworkgroup: C1[X(C11H17NO)]
method: RPBEPBE
basis: SDD
operation: Freq
keyword: #p
keyword: freq=noraman
keyword: PBEPBE/SDD
title: #p freq=noraman PBEPBE/SDD
converged: YES YES NO NO
title: Mulliken charges:
elementType: O N C C C C C C C C C C C H H H H H H H H H H H H H H H H H
charge: -0.253243 -0.051647 -0.293459 -0.310945 -0.442639 0.448748 -0.692456 -0.694926 -0.370466 -0.374971 -0.232160 -0.226781 -0.236326 0.199608 0.205492 0.195116 0.242839 0.199234 0.210989 0.214776 0.237332 0.207502 0.232537 0.211946 0.217140 0.243383 0.236220 0.225046 0.225250 0.226862
chargesum: 0.00000
title: Mulliken charges with hydrogens summed into heavy atoms:
elementType: O N C C C C C C C C C C C
charge: -0.253243 -0.051647 0.111641 0.127010 -0.032416 0.448748 -0.032847 -0.033303 -0.127083 -0.138752 -0.007113 -0.001531 -0.009465
polarizability: 1.55333728e+02 -1.34329354e+01 1.15142771e+02 8.12522404e+00 1.12506325e+01 1.11254702e+02
1716.lowfreq: 0.0005 0.0006 0.0007 5.1989 9.9916 15.8839 30.0295 41.0636 44.2334
frequency: 29.9020 40.8627 44.1169 78.8004 103.3428 124.2501 178.4316 213.8225 236.0682 264.2426 298.2965 312.7717 355.3094 402.5983 433.2051 444.2419 480.5487 498.9471 601.9436 617.4234 689.1416 701.6612 755.0984 791.5134 804.9637 814.3969 852.3670 852.7105 908.4142 923.8482 934.3526 973.5747 974.8305 990.0625 994.8004 1026.8213 1036.5879 1054.0066 1087.5068 1088.9734 1120.5287 1150.0189 1171.9283 1173.6932 1186.5884 1215.1094 1229.0690 1263.8476 1281.9907 1322.4760 1330.0866 1341.9280 1359.2571 1382.9392 1384.8806 1387.1709 1439.7306 1447.0534 1450.4252 1465.7523 1471.1239 1474.9810 1483.3964 1488.5203 1491.8793 1594.2685 1612.7567 2917.0403 2922.7382 2987.2820 2988.1170 2994.5069 3030.4867 3062.8695 3064.7607 3083.2400 3086.5470 3093.0277 3097.9627 3118.3108 3123.5731 3135.8220 3146.4404 3162.1996
redmass: 3.7284 3.3973 3.5356 2.1895 2.1129 3.5952 2.0292 1.5293 1.4982 1.6741 3.6341 2.7279 2.0467 2.7924 4.2744 3.3347 2.8510 4.0834 3.9643 6.2861 3.5208 1.7557 2.1693 1.2608 1.2613 2.9178 1.8719 1.4358 2.5300 1.8975 2.2822 1.8549 1.4203 5.5475 1.3494 2.2058 2.4104 2.5424 1.7824 1.6104 2.0574 1.9494 1.0538 2.1449 1.1164 2.4386 1.2557 1.1465 1.1720 1.2382 1.2318 1.2970 1.3728 1.2532 7.6905 1.2169 1.8995 1.2118 1.0783 1.0460 1.0464 1.0623 2.2476 1.0678 1.0541 6.1199 6.1131 1.0704 1.0675 1.0356 1.0358 1.0568 1.0908 1.1067 1.0932 1.0992 1.0972 1.1000 1.1004 1.0852 1.0871 1.0920 1.0964 1.1016
irintensity: 0.0781 0.3189 0.2528 0.1070 0.5405 1.7319 1.3019 1.3205 0.0785 0.7690 5.5555 3.1049 7.6960 0.0411 8.2855 0.3521 1.1813 7.7283 24.9394 0.3101 10.7349 53.4764 62.7991 3.8054 5.4322 9.5868 3.1685 0.7210 58.9057 1.3703 15.4277 7.3949 0.6970 0.0704 0.0177 3.5351 10.3020 7.6407 1.9776 4.8421 15.7395 1.4669 0.0154 7.4095 0.2793 12.5680 4.2376 7.4026 0.2661 11.6951 5.0582 4.4134 5.8569 22.5407 0.4389 23.2201 9.2219 8.1686 3.6355 13.1262 8.0603 2.6452 6.6790 10.5180 12.4533 0.5262 0.3947 12.7876 131.9348 29.2011 24.6904 55.8944 19.1300 17.4484 0.5488 42.8168 37.1656 51.9237 35.9053 3.7011 0.1342 17.6695 43.1357 20.9440
temp: 298.150 k
press: 1.00000 atm
elementType: 8 7 6 6 6 6 6 6 6 6 6 6 6 1 1 1 1 1 1 1 1 1 1 1 1 1 1 1 1 1
symmnumber: 1
zpe: 674401.2 jmol-1
zpe.correction: 0.256866 hartree
zpe.thermalcorrener: 0.270798 hartree
zpe.thermalcorrenthalpy: 0.271742 hartree
zpe.thermalcorrgfe: 0.214865 hartree
zpe.sumelectzpe: -558.273835 hartree
zpe.sumelectthermal: -558.259903 hartree
zpe.sumelectthermalent: -558.258959 hartree
zpe.sumelectthermalfe: -558.315836 hartree
dipole: 0.0705 0.7760 0.3132
dipole: 0.8398
quadrupole: -72.8991 -77.0263 -78.0361
quadrupole: -0.5591 2.4966 0.8831
quadrupole: 3.0881 -1.0391 -2.0490 -0.5591 2.4966 0.8831
hfenergy: -558.530701 hartree
pointgroup: C01 [X(C11H17N1O1)]
dipole: 0.1024152 -0.3141303 0.002083 debye
polarizability: 143.4365476|14.9474321|128.5236222|-21.4604182|-0.2434283|109.7710314 unknown
InChI: InChI=1S/C11H17NO/c1-3-12(4-2)13-10-11-8-6-5-7-9-11/h5-9H,3-4,10H2,1-2H3
charge 0 multiplicity 1
30 atoms
O  1.126395 1.522352 0.214453
N  1.930503 0.264647 -0.095518
C  3.287952 0.774944 -0.458584
C  1.939257 -0.513615 1.187106
C  -0.107918 1.517707 -0.614124
C  -1.140614 0.50216 -0.162608
C  3.286775 1.512908 -1.80481
C  2.530367 -1.920909 0.97858
C  -1.243658 -0.756576 -0.807076
C  -2.004872 0.787039 0.926003
C  -2.189903 -1.712825 -0.372535
C  -2.951378 -0.165575 1.364182
C  -3.046792 -1.419127 0.713984
H  3.684941 1.435432 0.346596
H  3.944263 -0.114157 -0.519602
H  2.489783 0.033404 1.98698
H  0.887068 -0.598402 1.504027
H  0.172569 1.351177 -1.670832
H  -0.479881 2.551619 -0.486721
H  2.910986 0.856033 -2.609512
H  2.647214 2.410432 -1.752658
H  4.311217 1.835349 -2.066826
H  2.012281 -2.433136 0.14872
H  3.611389 -1.896825 0.752762
H  2.393915 -2.521166 1.896313
H  -0.566898 -0.985361 -1.63839
H  -1.9283 1.757065 1.432813
H  -2.260414 -2.682221 -0.879137
H  -3.615144 0.06768 2.204555
H  -3.783302 -2.158156 1.049661
