program: Gaussian 09
title: 000274257
version: EM64L-G09RevD.01
frameworkgroup: C1[X(C20H17NO)]
method: RPBEPBE
basis: SDD
operation: Freq
keyword: #p
keyword: freq=noraman
keyword: PBEPBE/SDD
title: #p freq=noraman PBEPBE/SDD
converged: YES YES NO NO
title: Mulliken charges:
elementType: O N C C C C C C C C C C C C C C C C C C C C H H H H H H H H H H H H H H H H H
charge: -0.256425 -0.439250 0.358199 0.349914 0.365840 -0.569819 0.319662 -0.413562 -0.416384 -0.392727 -0.383940 -0.239466 0.485454 -0.369354 -0.472505 -0.395936 -0.398357 -0.236166 -0.240131 -0.242223 0.210987 -0.800469 0.245880 0.244027 0.243589 0.239533 0.241343 0.224862 0.307283 0.217019 0.239447 0.241239 0.309102 0.225453 0.225533 0.229398 0.236752 0.269620 0.236583
chargesum: 0.00000
title: Mulliken charges with hydrogens summed into heavy atoms:
elementType: O N C C C C C C C C C C C C C C C C C C C C
charge: -0.256425 -0.130147 0.358199 0.349914 0.365840 -0.323939 0.319662 -0.169535 -0.172795 -0.153194 -0.142597 -0.014604 0.485454 -0.062071 -0.255487 -0.156489 -0.157119 -0.010713 -0.014598 -0.012826 0.210987 -0.057515
polarizability: 4.11573101e+02 -2.03850506e+00 2.27806473e+02 -1.43158242e+01 3.73488795e+00 1.19832709e+02
1716.lowfreq: -84.9512 -9.2984 -4.2607 -0.0010 -0.0009 -0.0003 1.2804 25.5062 38.6964
frequency: -84.9489 25.4141 38.6712 42.5487 64.8239 74.1327 96.0312 100.1758 127.6523 160.0922 200.3915 230.1349 262.1628 291.1358 314.4411 354.2170 362.6374 391.6866 405.5568 411.3376 427.8101 482.3653 500.2834 538.4603 541.6137 581.6884 611.0080 611.9408 619.7452 636.7331 641.6894 645.5535 701.1404 702.3271 708.5052 737.4521 766.1319 793.1256 807.9119 826.8806 829.7394 849.7463 861.9924 903.7654 911.4262 923.8567 930.0397 946.4269 972.6739 980.8322 983.1332 985.4976 989.6698 991.8152 993.3000 995.8322 1014.4696 1029.6577 1036.4020 1061.9015 1084.2779 1101.6816 1126.8247 1173.0126 1185.9610 1194.8877 1197.8246 1220.2815 1253.9030 1264.5349 1303.5127 1306.0043 1315.3630 1319.7194 1349.3781 1371.4698 1373.6624 1375.4063 1410.5682 1420.2848 1441.6442 1448.6156 1467.1752 1468.1729 1489.7156 1501.4229 1516.8375 1577.7551 1584.3475 1592.6594 1610.4146 1613.0647 1624.5623 1634.3221 2987.4084 3072.2888 3107.5172 3122.2260 3125.2732 3127.4352 3133.2625 3136.2075 3137.9611 3140.1580 3142.8481 3147.3630 3148.7496 3159.3628 3164.7769 3195.5502 3519.4308
redmass: 1.0447 5.9327 4.1169 4.3600 4.3037 4.8747 4.8022 4.2968 4.5979 5.2688 4.5230 4.5185 4.5618 5.9692 5.2154 4.5425 4.1541 4.5112 2.8447 2.9821 3.6649 3.5829 3.4479 3.3910 3.5093 3.0049 5.6991 5.5467 5.3569 6.0352 1.1908 5.9267 2.4923 2.7909 1.9741 3.3612 1.8993 4.8628 1.6202 1.5540 3.6829 1.2502 1.4386 1.4452 1.4593 1.5341 5.8033 1.4006 1.4390 1.3953 2.8634 2.0914 1.8467 2.6893 1.3347 5.7908 2.9086 1.6628 2.1324 1.9245 1.6156 1.6583 1.3681 1.0522 1.0899 1.1292 1.1519 3.1008 2.0848 1.9258 1.4030 1.5193 1.4147 2.6866 3.5577 7.8133 4.0371 1.2646 4.0025 3.1893 2.3549 1.2003 2.1973 1.0471 2.1944 2.3505 3.1319 5.0223 5.2416 6.2572 6.1281 6.0770 5.9255 5.3233 1.0384 1.0983 1.0888 1.0844 1.0863 1.0869 1.0906 1.0978 1.0908 1.0917 1.0914 1.0946 1.0961 1.0992 1.1016 1.0946 1.0765
irintensity: 0.0128 1.0834 4.1999 0.4288 1.9498 5.5001 1.5711 0.6731 1.2747 2.4878 0.7826 1.2449 0.3527 1.2163 0.2303 0.2940 0.9713 7.3179 0.0543 0.2175 4.8196 2.5944 5.5796 14.4394 12.4475 0.6085 4.8587 6.8862 2.4264 1.1454 60.3649 16.9653 17.6730 10.9835 36.9722 8.0617 86.7707 5.4539 48.1273 26.0134 0.1565 0.4656 44.9317 7.1098 0.6209 1.2051 8.7663 1.4533 0.6058 1.3761 16.1495 13.0773 3.1953 2.4450 0.0390 2.3058 9.5069 7.8532 2.4320 3.4698 8.5039 7.5492 12.9108 0.0145 5.0717 0.9339 6.3178 81.1975 1.1118 40.6779 1.0089 18.8196 22.6784 16.4751 134.7339 2.4282 10.5740 65.1679 16.8708 100.5670 8.2218 45.6489 69.7051 20.0771 117.4283 165.5511 254.1335 25.3538 21.2653 22.8380 50.5536 9.1870 43.2043 133.9641 9.8281 15.6146 28.3196 8.1189 1.6863 5.5839 5.5809 7.8883 15.4680 25.1758 1.8021 12.7536 37.6665 26.9609 26.0036 4.8767 11.4021
temp: 298.150 k
press: 1.00000 atm
elementType: 8 7 6 6 6 6 6 6 6 6 6 6 6 6 6 6 6 6 6 6 6 6 1 1 1 1 1 1 1 1 1 1 1 1 1 1 1 1 1
symmnumber: 1
zpe: 816540.3 jmol-1
zpe.correction: 0.311004 hartree
zpe.thermalcorrener: 0.328961 hartree
zpe.thermalcorrenthalpy: 0.329905 hartree
zpe.thermalcorrgfe: 0.263160 hartree
zpe.sumelectzpe: -900.823846 hartree
zpe.sumelectthermal: -900.805889 hartree
zpe.sumelectthermalent: -900.804945 hartree
zpe.sumelectthermalfe: -900.871690 hartree
dipole: 0.2361 -3.2880 -2.0015
dipole: 3.8565
quadrupole: -116.0076 -112.8675 -133.2652
quadrupole: 19.9218 9.2936 0.4951
quadrupole: 4.7058 7.8460 -12.5518 19.9218 9.2936 0.4951
hfenergy: -901.1348494 hartree
pointgroup: C01 [X(C20H17N1O1)]
dipole: -0.0950612 -1.42019 0.5254601 debye
polarizability: 410.8729262|3.2818241|225.1257177|-20.1472202|17.0450511|123.2136396 unknown
InChI: InChI=1S/C20H17NO/c1-15(22)21-20-12-10-17(11-13-20)19-9-5-8-18(14-19)16-6-3-2-4-7-16/h2-14,21H,1H3
charge 0 multiplicity 1
39 atoms
O  6.370367 0.601509 -0.857124
N  5.060842 -1.143276 0.015988
C  -0.280521 1.044993 0.312843
C  1.101596 0.493278 0.228109
C  -2.739115 0.708522 0.204148
C  -1.412862 0.211251 0.117635
C  -3.909388 -0.191278 -0.018577
C  -0.499626 2.420397 0.602409
C  -2.924891 2.088045 0.495011
C  2.180687 1.275314 -0.266359
C  1.394044 -0.836047 0.640357
C  -1.811166 2.93143 0.690775
C  3.765018 -0.55476 0.065614
C  3.49449 0.775709 -0.352688
C  2.698802 -1.352791 0.562412
C  -5.119565 -0.009241 0.706642
C  -3.847836 -1.254447 -0.961747
C  -6.227677 -0.857538 0.496257
C  -4.954098 -2.10508 -1.172062
C  -6.151193 -1.911149 -0.444173
C  6.265473 -0.581163 -0.420131
C  7.457424 -1.535148 -0.32236
H  -1.258874 -0.850084 -0.10861
H  0.354662 3.080469 0.788662
H  -3.93735 2.504622 0.534635
H  1.986995 2.293636 -0.621665
H  0.598513 -1.462683 1.058032
H  -1.966271 3.992992 0.913409
H  4.30799 1.389126 -0.743057
H  2.895053 -2.37903 0.900326
H  -5.182489 0.7837 1.460588
H  -2.938744 -1.395143 -1.557437
H  5.111246 -2.110655 0.34549
H  -7.147015 -0.702832 1.072324
H  -4.886194 -2.911666 -1.910812
H  -7.011052 -2.570183 -0.607603
H  7.632977 -1.855762 0.721432
H  8.353271 -1.011827 -0.685601
H  7.301176 -2.440012 -0.938693
