program: Gaussian 09
title: 000026352
version: EM64L-G09RevD.01
frameworkgroup: C1[X(C11H9Cl3N4O2)]
method: RPBEPBE
basis: SDD
operation: Freq
keyword: #p
keyword: freq=noraman
keyword: PBEPBE/SDD
title: #p freq=noraman PBEPBE/SDD
converged: YES YES NO NO
title: Mulliken charges:
elementType: Cl Cl Cl O O N N N N C C C C C C C C C C C H H H H H H H H H
charge: -0.037459 -0.004930 0.006217 -0.199920 -0.198598 -0.413240 -0.175763 -0.150155 0.006766 0.643234 -0.420517 -0.223288 0.102412 -0.096559 -0.213257 -0.134954 0.032030 0.074529 -0.502997 -0.506763 0.343594 0.345095 0.284164 0.239358 0.239518 0.240320 0.238582 0.243720 0.238862
chargesum: 0.00000
title: Mulliken charges with hydrogens summed into heavy atoms:
elementType: Cl Cl Cl O O N N N N C C C C C C C C C C C
charge: -0.037459 -0.004930 0.006217 -0.199920 -0.198598 -0.069646 -0.175763 -0.150155 0.006766 0.643234 -0.420517 0.121806 0.102412 -0.096559 0.070907 -0.134954 0.032030 0.074529 0.216199 0.214402
polarizability: 3.04025851e+02 1.80735955e+01 2.30149358e+02 -9.42064947e-02 6.34362868e-02 7.69006585e+01
1716.lowfreq: -5.2892 -0.0023 -0.0014 0.0012 2.5305 2.9380 21.6063 36.6878 56.0877
frequency: 21.5429 36.6803 56.0830 76.8762 80.6097 128.3209 134.8592 141.7966 145.9749 151.1566 155.2003 180.2301 196.7033 203.5485 210.3756 239.6107 246.0261 256.7842 305.4588 317.9891 364.8004 378.2325 443.2757 448.1429 466.3667 516.5155 529.3725 573.9734 607.9182 624.1478 655.9764 671.7753 698.0206 707.6830 722.2322 748.3159 749.4089 793.8631 853.9381 862.1491 895.7550 909.2815 928.6944 962.9363 1019.0461 1043.0796 1078.1367 1109.8220 1113.8481 1114.7113 1145.8076 1159.0256 1223.5445 1234.5549 1258.0678 1284.0365 1350.4759 1360.6912 1377.5097 1392.9015 1421.3267 1449.6752 1453.5371 1455.9116 1458.7095 1460.1898 1462.8552 1469.6333 1518.2311 1536.3715 1576.2223 1607.3030 3001.9225 3005.7382 3105.4960 3109.6740 3149.4916 3150.4921 3174.7525 3182.6577 3484.6950
redmass: 6.6911 11.6587 8.0097 10.9656 3.2753 1.4476 5.9564 5.9324 5.8970 2.4804 1.1843 24.2867 6.7712 4.7478 6.1739 7.0736 8.7978 6.6553 7.8439 10.0426 9.3223 4.9253 11.7516 3.3244 6.4072 8.7645 10.1125 7.2456 8.8974 6.0654 7.3949 2.9380 8.7440 5.1029 7.9633 8.0089 1.7470 6.8960 1.4152 9.0599 13.6795 7.5242 1.3653 9.7834 6.8439 3.6975 7.3647 1.2514 1.2527 1.8956 1.4784 1.5844 2.4083 1.7465 6.3564 4.7835 4.7201 3.4608 8.5474 2.5392 2.2949 1.6752 1.0509 1.0566 1.5570 1.2119 1.0698 4.2769 4.9393 7.7372 4.0329 5.8146 1.0299 1.0294 1.1050 1.1047 1.1039 1.1048 1.0923 1.0933 1.0752
irintensity: 0.0000 0.4549 0.6610 2.4843 10.5924 0.0924 0.1480 1.1114 4.0525 0.0134 0.0105 0.1908 1.9002 0.0703 0.1562 5.6759 2.8519 0.6677 4.1845 3.4198 0.0007 2.4459 22.2355 15.1664 10.0799 48.5054 1.6790 2.6341 0.8013 6.8887 19.9861 19.2215 0.3842 0.2665 12.4118 16.0118 37.0297 50.3246 14.5811 5.9063 0.5040 10.0979 30.9513 0.6276 57.7625 47.6996 163.0180 0.0681 0.0813 26.3885 43.3880 2.6985 6.0259 13.9793 21.3520 265.5197 339.7105 553.2132 25.9393 99.3750 238.5284 292.2945 14.5575 20.0511 214.7892 318.0486 14.5332 463.6948 330.4333 396.8273 260.6550 228.4713 27.4859 36.8428 25.8198 25.7649 27.1713 25.4291 55.5423 0.3956 72.5477
temp: 298.150 k
press: 1.00000 atm
elementType: 17 17 17 8 8 7 7 7 7 6 6 6 6 6 6 6 6 6 6 6 1 1 1 1 1 1 1 1 1
symmnumber: 1
zpe: 507807.3 jmol-1
zpe.correction: 0.193414 hartree
zpe.thermalcorrener: 0.212743 hartree
zpe.thermalcorrenthalpy: 0.213687 hartree
zpe.thermalcorrgfe: 0.143709 hartree
zpe.sumelectzpe: -2172.748101 hartree
zpe.sumelectthermal: -2172.728772 hartree
zpe.sumelectthermalent: -2172.727828 hartree
zpe.sumelectthermalfe: -2172.797806 hartree
dipole: 0.8408 -2.7102 0.0005
dipole: 2.8376
quadrupole: -156.0020 -124.5350 -136.5622
quadrupole: 14.2876 -0.1116 -0.1106
quadrupole: -16.9689 14.4980 2.4709 14.2876 -0.1116 -0.1106
hfenergy: -2172.9415147 hartree
pointgroup: C01 [X(C11H9Cl3N4O2)]
dipole: 0.3764274 1.0490792 -0.0641456 debye
polarizability: 302.2282514|-20.8098852|231.0700048|6.2337002|-10.9327783|77.7776112 unknown
InChI: InChI=1S/C11H9Cl3N4O2/c1-19-10-16-9(17-11(18-10)20-2)15-8-4-6(13)5(12)3-7(8)14/h3-4,15H,1-2H3
charge 0 multiplicity 1
29 atoms
Cl 1.796629 3.579712 -0.186717
Cl 3.602939 -2.571207 0.241418
Cl 5.860304 -0.166761 0.134162
O  -4.712116 0.996612 -0.173427
O  -2.372837 -2.943646 0.171318
N  -0.049571 1.185347 -0.075156
N  -1.124487 -0.950851 0.052288
N  -2.362191 1.132708 -0.126755
N  -3.560641 -0.984738 -0.000304
C  1.305586 0.813445 -0.021516
C  2.304555 1.828258 -0.064543
C  1.748298 -0.532767 0.073234
C  -1.195395 0.409657 -0.047836
C  3.119918 -0.831062 0.120417
C  3.674391 1.535508 -0.017995
C  4.09116 0.190676 0.075484
C  -3.495749 0.374869 -0.09822
C  -2.342604 -1.579507 0.070976
C  -4.714247 2.473892 -0.284315
C  -1.07643 -3.65538 0.255391
H  -0.245307 2.190171 -0.148439
H  0.992055 -1.318772 0.107127
H  4.414383 2.338612 -0.053481
H  -4.189766 2.792907 -1.200302
H  -4.225448 2.927912 0.593584
H  -5.780696 2.735379 -0.32538
H  -0.478423 -3.480468 -0.654934
H  -1.359641 -4.713529 0.341065
H  -0.50897 -3.326177 1.142157
