program: Gaussian 09
title: 000274244
version: EM64L-G09RevD.01
frameworkgroup: C1[X(C13H18ClNO3)]
method: RPBEPBE
basis: SDD
operation: Freq
keyword: #p
keyword: freq=noraman
keyword: PBEPBE/SDD
title: #p freq=noraman PBEPBE/SDD
converged: YES YES NO NO
title: Mulliken charges:
elementType: Cl O O O N C C C C C C C C C C C C C H H H H H H H H H H H H H H H H H H
charge: -0.066788 -0.440054 -0.444696 -0.274595 -0.102709 0.204156 -0.344943 -0.420419 -0.746872 -0.589585 -0.208133 0.371580 0.189511 -0.364996 -0.340991 -0.113209 -0.226613 -0.534800 0.198622 0.187569 0.209743 0.230434 0.227351 0.267374 0.207746 0.230495 0.238335 0.291331 0.267890 0.352436 0.348755 0.245553 0.254047 0.224530 0.249257 0.222688
chargesum: 0.00000
title: Mulliken charges with hydrogens summed into heavy atoms:
elementType: Cl O O O N C C C C C C C C C C C C C
charge: -0.066788 -0.087618 -0.095941 -0.274595 -0.102709 0.204156 0.041248 0.019758 -0.044400 -0.120755 0.083198 0.371580 0.189511 -0.097106 -0.095438 -0.113209 0.027434 0.161676
polarizability: 2.01632519e+02 -5.06655141e+00 1.89670885e+02 1.63392479e+01 -1.43711738e-01 1.20386152e+02
1716.lowfreq: -11.8441 -8.5853 0.0017 0.0019 0.0023 1.6368 12.0423 17.6813 36.6968
frequency: -4.3778 16.9740 36.5603 82.2826 91.5749 97.4381 116.6576 133.9160 150.4728 168.1931 176.4751 194.8946 230.1301 239.5296 249.3488 261.3017 294.4627 313.3500 321.2085 332.7354 343.5103 366.8696 376.9466 385.0607 447.8569 460.3279 494.4075 517.2318 549.7978 589.3733 618.3538 623.2315 662.5287 724.7393 731.9586 759.1911 802.7697 841.6284 852.6445 884.1559 891.5745 920.8980 926.0053 945.0603 954.7889 987.2476 991.3514 1012.2764 1016.2409 1063.1559 1088.9649 1097.9557 1114.8575 1122.2639 1151.9596 1156.6354 1172.0482 1187.6068 1190.0431 1195.9865 1234.5852 1250.5722 1270.7243 1283.7669 1318.6034 1324.9388 1359.0308 1372.4754 1377.7246 1381.3106 1404.2679 1405.6846 1438.0785 1443.8368 1452.9877 1463.3406 1468.8103 1469.5885 1477.6516 1483.1851 1486.4604 1588.9271 1597.8806 1640.6717 2930.5836 2949.5346 2964.4411 2976.8973 2991.8622 3025.3366 3051.7363 3054.2907 3069.2734 3073.4585 3079.3066 3094.4442 3129.6595 3157.5015 3159.0458 3177.7493 3327.8676 3572.9572
redmass: 5.6408 6.3358 4.6707 3.9133 2.8942 5.7576 5.0256 4.3242 3.4051 3.3940 4.2361 3.9612 2.2279 1.2776 1.8183 1.7384 2.7162 3.4441 2.7157 1.2323 3.9198 4.1919 3.7659 5.1746 3.2055 3.1044 3.0841 3.5965 3.6032 4.3091 5.0581 2.9820 1.3418 4.7512 3.5018 3.6976 1.5181 2.2100 3.4796 2.0106 1.4811 2.2769 1.3426 2.1697 1.7219 8.7961 2.3866 1.6140 4.3332 2.6459 2.0086 1.4113 1.2598 2.1392 1.5151 2.2129 1.1196 1.7073 1.5011 2.5837 3.6703 1.8464 1.2926 1.3691 1.2404 1.2516 1.3202 1.2078 7.4809 1.2191 1.2962 2.9489 1.2030 1.1392 1.0761 1.0563 1.1246 1.2209 1.0864 1.6340 1.0505 8.1131 6.8946 8.0990 1.0680 1.0688 1.0328 1.0369 1.0619 1.0906 1.0940 1.1041 1.0959 1.0987 1.0989 1.0985 1.0997 1.0880 1.0926 1.0968 1.0634 1.0660
irintensity: 0.3167 0.1504 0.0673 1.5848 7.2661 1.5980 5.5972 12.7951 0.9015 1.1593 2.7255 2.2348 1.4398 2.2377 0.9355 23.1887 1.5961 7.4973 22.8187 130.1069 8.4031 1.3462 2.8456 8.8901 2.6992 13.6907 7.4235 4.1347 11.8208 19.2163 14.6299 30.5400 149.1621 8.3536 6.3884 7.2815 54.2435 14.9550 31.0365 3.4834 15.5637 17.3526 0.3739 35.6036 20.9156 36.4037 64.2666 4.2351 15.0525 45.9879 7.3684 50.7458 0.1158 70.4297 5.5875 17.8836 6.3946 29.3760 9.6637 13.1717 105.6879 38.5327 6.7090 3.1487 25.1995 2.3670 9.7540 19.2471 14.1500 23.6377 77.4261 20.4927 12.9125 18.7314 4.5738 8.1457 53.4834 98.0856 4.3545 45.4133 11.2320 0.6617 17.8250 111.7766 64.6247 99.3274 65.0604 24.6761 11.7056 3.2330 34.7889 43.0289 17.7681 52.7476 9.4528 7.3843 18.1233 6.0400 0.8033 5.5138 132.9967 5.6030
temp: 298.150 k
press: 1.00000 atm
elementType: 17 8 8 8 7 6 6 6 6 6 6 6 6 6 6 6 6 6 1 1 1 1 1 1 1 1 1 1 1 1 1 1 1 1 1 1
symmnumber: 1
zpe: 756686.2 jmol-1
zpe.correction: 0.288207 hartree
zpe.thermalcorrener: 0.306928 hartree
zpe.thermalcorrenthalpy: 0.307872 hartree
zpe.thermalcorrgfe: 0.240619 hartree
zpe.sumelectzpe: -1245.232983 hartree
zpe.sumelectthermal: -1245.214262 hartree
zpe.sumelectthermalent: -1245.213318 hartree
zpe.sumelectthermalfe: -1245.280570 hartree
dipole: 0.9593 5.3184 1.9384
dipole: 5.7413
quadrupole: -117.2630 -117.2789 -111.0415
quadrupole: 2.9574 -6.6611 -1.9836
quadrupole: -2.0685 -2.0844 4.1529 2.9574 -6.6611 -1.9836
hfenergy: -1245.5211893 hartree
pointgroup: C01 [X(C13H18Cl1N1O3)]
dipole: 1.0895634 -0.3191566 -1.9527405 debye
polarizability: 198.6535355|13.4692518|142.1988022|1.4380194|35.1625315|170.8372179 unknown
InChI: InChI=1S/C13H18ClNO3/c1-13(8-16,9-17)15-6-5-10-7-11(14)3-4-12(10)18-2/h3-4,6-7,16-17H,5,8-9H2,1-2H3
charge 0 multiplicity 1
36 atoms
Cl 2.936515 2.261797 3.612583
O  -4.635796 -0.182076 1.605027
O  -2.055689 0.104749 -2.681367
O  1.880264 -1.6037 -0.889882
N  -2.253964 -0.499143 0.506843
C  -3.264264 0.078355 -0.440702
C  -4.636901 -0.374575 0.162279
C  -3.175489 -0.443562 -1.898591
C  -3.146066 1.621548 -0.378045
C  -0.055456 -1.395747 1.109467
C  -1.053389 -0.812757 0.122004
C  1.224518 -0.571258 1.161018
C  2.198968 -0.685275 0.124803
C  1.466102 0.335703 2.215639
C  3.385468 0.084956 0.154425
C  2.650535 1.099448 2.232704
C  3.615048 0.987705 1.21851
C  2.838807 -1.771805 -1.985466
H  -5.461507 0.235912 -0.246524
H  -4.816077 -1.442625 -0.095798
H  -4.141124 -0.242471 -2.412296
H  -3.00149 -1.533483 -1.900194
H  -2.123595 1.957594 -0.627928
H  -3.378253 1.967004 0.643673
H  -3.866797 2.098879 -1.069587
H  -0.531301 -1.44988 2.103092
H  0.191084 -2.423384 0.777624
H  -0.69421 -0.67566 -0.91456
H  0.72949 0.441788 3.017963
H  -3.69951 -0.433617 1.870864
H  -2.192393 1.078098 -2.799571
H  4.137569 -0.002596 -0.634624
H  4.528812 1.587683 1.249394
H  2.982372 -0.824681 -2.540226
H  2.387161 -2.523941 -2.648296
H  3.81446 -2.13858 -1.612053
