program: Gaussian 09
title: 000274258
version: EM64L-G09RevD.01
frameworkgroup: C1[X(C16H21N3O4)]
method: RPBEPBE
basis: SDD
operation: Freq
keyword: #p
keyword: freq=noraman
keyword: PBEPBE/SDD
title: #p freq=noraman PBEPBE/SDD
converged: YES YES NO NO
title: Mulliken charges:
elementType: O O O O N N N C C C C C C C C C C C C C C C C H H H H H H H H H H H H H H H H H H H H H
charge: -0.471819 -0.251637 -0.197976 -0.161566 -0.191360 0.027849 0.013670 -0.438008 -0.179881 0.377939 -0.301069 -0.326613 0.347763 -0.221444 -0.331799 -0.600436 -0.675900 -0.667943 0.385035 -0.375639 0.324937 -0.516419 -0.535277 0.224012 0.244311 0.198388 0.205261 0.209806 0.205754 0.212380 0.289289 0.244099 0.231096 0.212805 0.218176 0.225983 0.221979 0.219496 0.363058 0.246144 0.294960 0.255199 0.219295 0.226104
chargesum: 0.00000
title: Mulliken charges with hydrogens summed into heavy atoms:
elementType: O O O O N N N C C C C C C C C C C C C C C C C
charge: -0.108761 -0.251637 -0.197976 -0.161566 -0.191360 0.027849 0.013670 0.030315 0.018508 0.377939 0.113998 0.091520 0.347763 -0.221444 -0.042510 -0.356338 -0.013824 -0.000484 0.385035 -0.129495 0.324937 -0.221459 0.165321
polarizability: 2.78814145e+02 2.56763496e+00 2.55688623e+02 9.50154001e+00 4.73813348e+00 1.37066958e+02
1716.lowfreq: -6.2465 -5.8024 -0.0003 0.0008 0.0009 5.0161 20.2391 23.9756 28.5992
frequency: 19.5494 23.8350 28.4744 45.6056 56.8989 69.3587 80.9034 85.6947 97.1070 133.2118 143.0994 150.4177 154.8599 181.5857 207.5959 213.2689 231.3522 236.7028 261.7962 285.2218 295.4894 306.5841 312.1752 330.3443 375.7900 380.5109 399.3117 438.3823 452.2586 468.3127 499.5360 513.4522 539.2524 559.6447 583.8956 632.3618 637.4269 677.0444 700.1724 705.2596 738.9349 764.1316 775.0519 795.7326 796.8836 803.1897 833.1416 859.8860 863.4066 884.7478 890.6008 904.5358 906.5980 916.6082 982.9375 991.0686 1005.5733 1015.6416 1032.9749 1063.0768 1070.5147 1075.4695 1085.3351 1088.1041 1109.4292 1113.8062 1155.6140 1156.6056 1194.4729 1199.5323 1210.9579 1228.5416 1232.6876 1237.0304 1260.6724 1264.9524 1281.0705 1288.7956 1308.9953 1344.9783 1349.1230 1360.5208 1363.1299 1370.1582 1373.6119 1385.6302 1390.2038 1393.9162 1401.3454 1426.5877 1435.0432 1454.0976 1461.2637 1465.4386 1467.3459 1469.9561 1471.2430 1475.9129 1478.8349 1485.3906 1490.9124 1501.7092 1556.4163 1584.9046 1624.8579 2900.7117 2907.6164 2910.2899 2947.3418 2961.2119 2987.7491 2988.3134 3020.2715 3045.8536 3050.7544 3072.4308 3081.7190 3084.3386 3088.5816 3092.7450 3094.9631 3133.1209 3135.0493 3167.2592 3183.7994 3183.9765
redmass: 3.9080 3.8339 4.8798 8.0008 3.1501 2.9276 3.2625 2.7237 3.8636 4.5655 3.6010 4.5305 2.4449 2.8835 1.5477 2.9872 1.3629 1.7705 2.8432 2.2397 4.4563 3.3522 5.3399 4.9143 5.2530 2.7414 6.3719 2.6616 5.3991 2.9582 4.9808 5.6524 4.4302 4.4478 3.7035 3.9433 4.8055 4.4857 7.3071 6.3180 4.1611 2.4622 1.2613 1.4033 1.1477 2.5726 3.0588 2.3473 5.0342 1.3486 3.6296 2.4631 2.2041 2.3333 1.6227 1.9547 5.0802 3.1422 2.6518 2.5482 2.1019 2.1568 2.7626 2.0422 1.9334 1.2619 1.5090 1.4947 2.3559 2.2322 2.0122 2.3141 4.8274 1.6462 2.6249 1.3045 1.1384 1.2218 2.0016 1.5510 1.3125 2.0612 1.4294 1.4888 3.2769 10.4591 1.2248 1.2295 1.5236 1.4807 2.5496 1.0950 2.3213 1.0520 1.0506 1.0914 1.0923 1.0550 1.0466 1.0743 1.0789 4.9545 7.7335 6.9838 7.0380 1.0696 1.0799 1.0722 1.0687 1.0332 1.0358 1.0359 1.0908 1.0896 1.1040 1.0937 1.0970 1.0975 1.0759 1.1007 1.0899 1.0993 1.0908 1.0898 1.0937 1.0933
irintensity: 0.1893 0.4591 0.8400 1.2895 0.8040 0.0588 1.0836 2.5568 1.1462 2.5401 0.0878 0.7863 0.2399 1.1986 2.4882 6.7211 0.4959 1.4808 1.3964 7.1732 2.6436 3.9933 8.3306 0.4863 1.5589 6.3078 1.0557 2.7943 5.1158 0.9205 2.1977 4.6235 2.8254 3.4545 4.9378 3.4260 36.6113 5.7442 28.2317 5.2204 10.9038 14.0920 54.2162 7.7821 9.5199 4.5994 7.8012 11.8070 7.9324 47.2723 5.3867 20.3335 11.2307 2.3309 1.1659 12.2637 24.9610 62.9557 12.9564 42.4282 64.7343 13.7376 13.9200 3.4486 13.4488 0.1635 13.3025 14.6502 99.1856 40.2625 27.4010 22.1505 107.1481 10.5702 172.1354 6.3323 9.7457 17.5551 3.2790 14.7595 16.2219 18.7701 2.1641 9.0649 16.9063 128.3358 23.9787 15.4693 59.0280 37.7201 13.8024 4.9597 66.2221 6.7741 16.4167 23.3260 11.8575 12.7043 4.4680 12.1064 21.1235 33.0819 10.2197 43.1970 117.3423 38.5285 60.9391 90.2696 58.6380 45.6272 28.4026 18.0902 18.8504 13.5994 42.1578 11.7448 44.5109 28.8302 281.0727 26.0013 91.7839 22.8911 19.1205 11.1578 2.0090 2.9682
temp: 298.150 k
press: 1.00000 atm
elementType: 8 8 8 8 7 7 7 6 6 6 6 6 6 6 6 6 6 6 6 6 6 6 6 1 1 1 1 1 1 1 1 1 1 1 1 1 1 1 1 1 1 1 1 1
symmnumber: 1
zpe: 924244.9 jmol-1
zpe.correction: 0.352026 hartree
zpe.thermalcorrener: 0.375178 hartree
zpe.thermalcorrenthalpy: 0.376122 hartree
zpe.thermalcorrgfe: 0.297196 hartree
zpe.sumelectzpe: -1085.603112 hartree
zpe.sumelectthermal: -1085.579960 hartree
zpe.sumelectthermalent: -1085.579016 hartree
zpe.sumelectthermalfe: -1085.657943 hartree
dipole: -10.0974 5.5102 1.4454
dipole: 11.5935
quadrupole: -160.0090 -125.2331 -141.6555
quadrupole: 5.6155 -8.9631 -1.0640
quadrupole: -17.7098 17.0661 0.6437 5.6155 -8.9631 -1.0640
hfenergy: -1085.9551384 hartree
pointgroup: C01 [X(C16H21N3O4)]
dipole: 4.0095258 -2.14095 0.3804536 debye
polarizability: 278.6386281|3.7134542|255.7989148|-9.7886034|4.6354933|137.1321833 unknown
InChI: InChI=1S/C16H21N3O4/c1-4-18(5-2)10-15(20)12-6-7-17-16-13(12)8-11(23-3)9-14(16)19(21)22/h6-9,15,20H,4-5,10H2,1-3H3
charge 0 multiplicity 1
44 atoms
O  2.688012 1.401121 -1.390664
O  -1.837111 -3.470657 -0.034177
O  -5.464259 0.098198 -0.087798
O  -4.470039 1.421965 1.486649
N  3.945718 -0.060035 0.392213
N  -2.170283 2.149707 -0.150406
N  -4.432556 0.54009 0.555086
C  2.471269 -0.009537 0.580305
C  1.814361 0.405764 -0.790894
C  0.417927 0.97385 -0.594648
C  4.416189 -1.375349 -0.139865
C  4.720537 0.422251 1.576328
C  -0.718151 0.125096 -0.319189
C  -1.987784 0.783532 -0.073163
C  0.214378 2.356054 -0.660188
C  -0.641018 -1.30684 -0.298293
C  5.740009 -1.273389 -0.919265
C  4.677236 1.952557 1.737854
C  -3.117727 -0.060903 0.217008
C  -1.088921 2.896652 -0.446618
C  -1.787516 -2.07426 -0.056187
C  -3.044709 -1.445829 0.200657
C  -0.595795 -4.199736 -0.309566
H  2.050954 -0.968229 0.953432
H  2.237458 0.772748 1.32201
H  1.761958 -0.488222 -1.45391
H  4.510139 -2.121769 0.684432
H  3.632808 -1.752193 -0.824395
H  4.361696 -0.072709 2.509238
H  5.769975 0.108566 1.435073
H  1.061362 3.001804 -0.903494
H  0.315532 -1.795866 -0.498459
H  5.635993 -0.568109 -1.76219
H  6.573206 -0.92684 -0.282321
H  6.021556 -2.262811 -1.323777
H  5.093522 2.449523 0.844264
H  3.648863 2.327592 1.885473
H  5.27267 2.257426 2.617732
H  3.589263 1.161187 -0.980108
H  -1.25762 3.976861 -0.522545
H  -3.927524 -2.063571 0.384053
H  -0.868724 -5.262743 -0.249018
H  0.179322 -3.969023 0.447143
H  -0.213376 -3.968122 -1.322509
