program: Gaussian 09
title: 000274212
version: EM64L-G09RevD.01
frameworkgroup: C1[X(C13H9ClN2O)]
method: RPBEPBE
basis: SDD
operation: Freq
keyword: #p
keyword: freq=noraman
keyword: PBEPBE/SDD
title: #p freq=noraman PBEPBE/SDD
converged: YES YES NO NO
title: Mulliken charges:
elementType: Cl O N N C C C C C C C C C C C C C H H H H H H H H H
charge: -0.044095 -0.274556 0.000158 -0.004869 0.359394 0.200265 -0.311926 -0.344936 -0.151246 -0.276247 -0.224226 -0.175981 -0.532774 -0.277005 0.284890 -0.242562 -0.254530 0.261866 0.252674 0.270571 0.261417 0.249759 0.230324 0.253767 0.230341 0.259528
chargesum: 0.00000
title: Mulliken charges with hydrogens summed into heavy atoms:
elementType: Cl O N N C C C C C C C C C C C C C
charge: -0.044095 -0.274556 0.000158 -0.004869 0.359394 0.200265 -0.050060 -0.092262 -0.151246 -0.005676 0.037191 0.073777 0.181658 -0.017477 0.284890 -0.242562 -0.254530
polarizability: 3.98710094e+02 -1.20680698e+01 2.06105790e+02 1.41395883e-03 -2.99221466e-02 6.70180803e+01
1716.lowfreq: -0.0018 -0.0006 0.0010 2.8174 6.1325 7.3286 24.1734 42.5381 49.4673
frequency: 24.1406 42.5277 49.4504 78.8787 107.8763 117.7591 119.3933 148.0592 177.1763 213.1793 227.5458 240.4456 246.2115 282.0310 322.0844 325.1865 361.6214 364.4443 424.5730 449.2540 484.5836 520.1739 558.6847 558.9322 590.3297 602.6399 624.0470 647.2940 730.7454 743.3450 794.4068 807.9269 885.0214 904.1050 904.4137 930.0822 936.4940 983.2654 1010.8679 1083.9488 1112.6704 1114.8919 1145.5319 1153.4546 1190.1788 1221.5498 1240.8070 1276.8978 1292.1292 1305.3470 1338.6769 1385.8190 1410.8249 1436.7859 1464.0477 1470.7476 1477.4132 1550.1392 1573.9832 1595.6103 1612.2832 2160.9220 2171.7918 2973.1703 3067.2851 3117.8463 3126.5403 3134.1564 3136.5995 3162.6449 3170.6958 3181.5649
redmass: 9.1134 10.5913 5.9138 3.8905 9.9013 4.8903 12.5683 5.6812 5.1186 1.9017 2.5247 1.6951 8.1364 5.3285 6.4374 4.6288 7.7751 3.8452 6.3641 5.5744 3.7079 6.3740 4.0066 6.7052 12.1065 4.3590 7.3403 7.0551 3.1073 5.7359 6.5094 1.5042 1.4399 5.2782 1.7996 1.5330 1.3520 8.7933 1.1411 2.1192 1.2568 2.6647 2.5203 1.5476 1.4755 2.8825 3.0158 1.3839 1.5873 1.6176 1.9114 6.0578 3.2494 1.2825 1.5818 1.0495 1.3320 6.8050 6.6026 6.0975 4.8645 12.6187 12.6348 1.0324 1.1047 1.0940 1.0918 1.0863 1.1004 1.0882 1.0920 1.0971
irintensity: 0.1273 0.7613 0.0962 1.2360 3.2224 12.8745 1.4501 0.0847 2.6541 1.6795 1.5836 0.0618 0.3532 4.5600 4.2548 0.8222 1.1221 0.3375 0.2229 0.7130 6.9661 0.1089 5.4842 27.6745 0.1108 13.9363 19.2434 0.6060 0.0007 2.9114 6.5890 49.9404 12.3245 37.6892 3.3289 0.0208 0.0933 42.3686 70.9712 6.8298 0.0721 54.6396 13.3546 2.7350 57.4581 199.2897 111.7274 34.3124 15.5870 58.1635 49.4921 49.0454 47.4298 20.2973 200.8629 15.9847 14.5494 106.5667 0.1328 39.9086 298.1643 11.0411 99.8065 79.5712 37.2990 0.4728 0.5042 22.0721 12.9964 6.5243 0.4940 5.8430
temp: 298.150 k
press: 1.00000 atm
elementType: 17 8 7 7 6 6 6 6 6 6 6 6 6 6 6 6 6 1 1 1 1 1 1 1 1 1
symmnumber: 1
zpe: 480875.8 jmol-1
zpe.correction: 0.183156 hartree
zpe.thermalcorrener: 0.199592 hartree
zpe.thermalcorrenthalpy: 0.200536 hartree
zpe.thermalcorrgfe: 0.137117 hartree
zpe.sumelectzpe: -1144.319450 hartree
zpe.sumelectthermal: -1144.303014 hartree
zpe.sumelectthermalent: -1144.302070 hartree
zpe.sumelectthermalfe: -1144.365488 hartree
dipole: -8.9930 5.7650 0.0013
dipole: 10.6822
quadrupole: -134.1075 -103.9326 -108.0801
quadrupole: -10.7053 -0.0303 0.0162
quadrupole: -18.7341 11.4408 7.2933 -10.7053 -0.0303 0.0162
hfenergy: -1144.5026057 hartree
pointgroup: C01 [X(C13H9Cl1N2O1)]
dipole: -3.5119017 -2.2409971 -0.5542884 debye
dipolederiv: -0.1962626 0.1632885 0.0092843 0.4201482 -0.717538 -0.0495337 0.0412355 -0.0697318 -0.0611191 -0.1245193 0.1080165 0.025659 -0.7839987 -1.7705192 -0.2471741 -0.0852894 -0.1769422 -0.3099956 -0.5623624 0.0246104 -0.022633 0.2129427 -0.2107723 0.0195761 0.0007476 0.0048333 -0.233689 -0.165129 0.0024177 0.0055697 -0.3282984 -0.3138641 -0.0357539 -0.0353041 -0.0098462 -0.2367857 -0.6738906 -0.1464472 -0.0707866 0.3800774 -0.1865885 0.0071639 -0.006366 -0.0345379 -0.0084407 -0.1565047 -0.5292388 -0.0846353 0.6958148 1.4348026 0.2231623 0.0672907 0.1266288 0.100956 0.1731072 0.1035753 0.0322192 -0.3142061 -0.232517 -0.0448643 -0.0188539 -0.0120913 -0.0738191 0.2496771 0.371446 0.0802086 -0.0963167 -0.2892115 -0.0210692 0.0222417 0.016133 -0.1775955 -0.4246183 -0.3724709 -0.0727831 -0.8731041 1.0275266 0.0706 -0.1357057 0.1099349 -0.0849537 1.3153848 0.0758216 0.1187444 -0.0038157 0.0951212 0.0208667 0.1092302 0.0273312 -0.0670701 0.0198758 0.034976 0.0123471 0.6119397 -0.0130837 0.0560875 0.0840341 0.010774 -0.0711024 -1.3393809 -0.1141229 -0.1062391 -0.1707869 0.0299992 0.0102759 -0.1129251 0.0148597 -0.1711455 0.5156655 0.4571649 0.072837 0.3995839 0.7602182 0.0871126 0.0659665 0.0921793 0.3309366 1.5429943 0.2643938 0.1583634 -0.0372963 0.0377864 0.0094308 0.1208342 0.0329649 -0.0496012 -0.8465716 -0.1186985 -0.0898431 -0.4843309 0.1147138 -0.0376651 -0.1345507 -0.0089778 0.1015639 0.6317084 -0.12819 0.0299219 -0.3535898 -0.0780091 -0.0430246 0.002046 -0.0253538 0.0434306 -0.1161316 0.0443701 -0.0077094 0.5640535 0.2844762 0.0727499 0.0564335 0.0320371 0.0616766 0.0534986 -0.0731051 -0.0166247 -0.0611931 0.0492109 -0.0171146 -0.0152014 -0.0180363 0.1446794 0.0013756 -0.0792688 -0.0230298 -0.1021528 -0.0085336 -0.0299806 -0.0259716 -0.0281866 0.1622561 0.0788274 0.0570337 0.0011845 0.1033441 0.0019327 -0.010507 0.0070857 -0.014204 0.1526706 -0.0084236 0.0393541 -0.0086201 0.0479832 0.0886392 -0.0052975 -0.0074281 -0.006015 0.160521 0.0507835 0.0210586 -0.0062518 0.0675312 -0.0461921 -0.0204399 -0.0007035 -0.0241246 0.160982 -0.0919481 -0.1585858 0.0817503 0.0004482 0.0391809 -0.0403806 0.113351 0.0146987 -0.0606313 0.0562015 0.1072541 0.0077377 0.0150889 -0.0916334 -0.026285 -0.0037745 -0.0190554 0.1254147 -0.0579112 -0.1311842 -0.1180435 0.020189 0.0290541 0.0690579 -0.1110646 -0.0109384 -0.0844538 0.0745546 -0.0234692 -0.0086277 0.0699447 -0.0341995 -0.0169933 0.0026418 -0.0243337 0.1453152 unknown
polarizability: 396.544616|10.0834875|203.9434013|27.0678011|17.7843274|71.3459472 unknown
InChI: InChI=1S/C13H9ClN2O/c1-17-13-6-5-12(14)7-11(13)4-2-3-10(8-15)9-16/h2-7H,1H3
charge 0 multiplicity 1
26 atoms
Cl -3.414978 3.314765 0.117744
O  -1.865141 -2.47404 -0.480004
N  6.100094 -0.900382 0.338518
N  3.730065 2.931201 0.627527
C  -1.240391 -0.180505 -0.14524
C  -2.285248 -1.149432 -0.348314
C  -1.615437 1.187799 -0.005025
C  -3.641562 -0.75028 -0.406288
C  -2.963629 1.560493 -0.065489
C  0.145345 -0.629614 -0.091779
C  -3.986299 0.609961 -0.264749
C  1.265408 0.160486 0.092736
C  -2.882518 -3.511376 -0.691652
C  2.584583 -0.406016 0.126009
C  3.764889 0.315675 0.30702
C  5.039836 -0.344131 0.324733
C  3.756873 1.742955 0.482839
H  -0.850483 1.953203 0.15063
H  -4.437813 -1.482714 -0.560416
H  0.288907 -1.710883 -0.213288
H  -5.03282 0.924078 -0.308791
H  1.178714 1.247119 0.219032
H  -3.583546 -3.560922 0.162637
H  -2.317553 -4.451312 -0.764795
H  -3.44033 -3.335513 -1.630618
H  2.679236 -1.492817 -0.000477
