program: Gaussian 09
title: 000274241
version: EM64L-G09RevD.01
frameworkgroup: C1[X(C14H13NO3S)]
method: RPBEPBE
basis: SDD
operation: Freq
keyword: #p
keyword: freq=noraman
keyword: PBEPBE/SDD
title: #p freq=noraman PBEPBE/SDD
converged: YES YES NO NO
title: Mulliken charges:
elementType: S O O O N C C C C C C C C C C C C C C H H H H H H H H H H H H H
charge: 0.994683 -0.530285 -0.507170 -0.211343 -0.752629 -0.027900 0.399512 -0.242801 -0.233608 0.450846 0.201514 -0.361593 -0.365230 -0.351986 -0.332187 -0.796409 -0.213846 -0.244732 -0.194844 0.356405 0.283225 0.279059 0.248139 0.247121 0.285743 0.275650 0.232777 0.232816 0.246365 0.234741 0.237621 0.160346
chargesum: 0.00000
title: Mulliken charges with hydrogens summed into heavy atoms:
elementType: S O O O N C C C C C C C C C C C C C C
charge: 0.994683 -0.530285 -0.507170 -0.211343 -0.396224 -0.027900 0.399512 0.040424 0.045451 0.450846 0.201514 -0.113454 -0.118109 -0.066243 -0.056537 -0.084450 0.020895 -0.007110 -0.034498
polarizability: 2.12084253e+02 -6.18966523e+00 1.71735769e+02 -1.38593599e-01 7.58438470e+00 2.03838716e+02
1716.lowfreq: -22.8126 -6.4131 -2.9478 -0.0016 -0.0014 0.0009 4.7419 8.9079 19.5549
frequency: -22.7422 7.1687 19.3393 31.4822 75.7074 102.6022 111.1034 124.2047 130.1899 177.0666 201.9777 204.0673 220.9320 234.3698 266.1082 274.7898 301.4163 329.6211 378.2194 399.0583 406.3359 424.0238 444.3555 455.8192 503.5570 521.8039 580.5183 590.0995 620.6782 633.0703 677.0296 705.6116 734.0119 775.8430 777.2565 805.2853 808.0066 827.5895 845.0452 848.0088 893.4541 947.3393 960.3846 967.6610 980.2838 990.1841 991.4188 992.1212 1003.1600 1041.9213 1049.5246 1050.9128 1086.3050 1120.8244 1173.6191 1185.7074 1204.5860 1218.8989 1234.6711 1296.3804 1298.3156 1306.8315 1365.7276 1382.5224 1391.7450 1398.8130 1409.7666 1443.6545 1469.5339 1470.0477 1472.4384 1474.4011 1566.4476 1590.1372 1593.2269 1595.4437 1616.4962 2880.3223 2982.3857 3065.4077 3094.7266 3134.3555 3139.2115 3140.6668 3144.4069 3158.4192 3163.9642 3168.7973 3170.7535 3530.0764
redmass: 1.0137 5.6193 5.3182 4.3790 5.2609 6.9563 3.3628 5.1759 6.1578 8.6031 4.8662 2.4345 5.3945 6.6086 3.5220 4.9657 4.3921 2.3960 3.6019 8.4045 2.8779 5.6106 3.9788 5.0699 3.0830 3.4469 5.9111 6.7553 6.9527 6.9705 5.4716 3.2735 3.8322 4.3718 1.3158 4.9645 9.5091 1.4174 1.2513 5.0492 1.3456 10.6428 1.3064 1.5921 1.3971 1.4743 5.2865 1.4584 1.3878 2.0989 1.6190 2.3991 2.3617 1.2839 1.0937 1.1387 1.5555 3.0630 2.3051 1.7768 1.3829 1.4829 2.4739 6.1492 2.9729 1.2172 1.9165 2.5767 1.5009 1.5357 2.2516 1.0724 6.8251 5.9310 5.9715 6.9647 6.3206 1.0834 1.0390 1.0947 1.1002 1.0861 1.0893 1.0893 1.0899 1.0947 1.0961 1.0964 1.1004 1.0780
irintensity: 0.5540 1.2343 1.4938 1.1609 0.4553 6.5660 9.6906 2.3039 1.3988 0.5480 11.8657 51.0496 32.4080 1.4551 22.5779 8.1803 0.6315 25.4670 0.3236 31.6890 0.5942 12.1942 97.1766 22.8099 68.1112 3.5221 8.8396 47.0880 0.5904 39.3051 104.6630 3.4121 9.2315 18.1943 92.4813 36.6861 133.8126 23.2809 0.5764 40.6909 5.6309 60.8916 1.2510 0.7851 0.9324 5.1721 0.5398 5.0636 0.3291 13.5613 28.5065 20.9890 9.4444 8.3371 7.1041 10.6437 15.7782 9.1988 89.8854 79.9266 20.3180 27.9679 1.3191 0.3512 10.4213 17.4315 52.6891 58.3111 34.6527 66.5027 20.8696 13.4265 6.8654 239.8015 14.7885 0.0650 103.2737 99.2610 19.5199 15.7464 13.2170 3.4497 11.1815 5.7719 2.0062 1.3279 1.9686 6.5251 23.1057 58.9395
temp: 298.150 k
press: 1.00000 atm
elementType: 16 8 8 8 7 6 6 6 6 6 6 6 6 6 6 6 6 6 6 1 1 1 1 1 1 1 1 1 1 1 1 1
symmnumber: 1
zpe: 619556.6 jmol-1
zpe.correction: 0.235977 hartree
zpe.thermalcorrener: 0.253965 hartree
zpe.thermalcorrenthalpy: 0.254910 hartree
zpe.thermalcorrgfe: 0.186819 hartree
zpe.sumelectzpe: -1218.231933 hartree
zpe.sumelectthermal: -1218.213944 hartree
zpe.sumelectthermalent: -1218.213000 hartree
zpe.sumelectthermalfe: -1218.281091 hartree
dipole: -4.1889 -4.4870 -2.1375
dipole: 6.4999
quadrupole: -112.3194 -131.8345 -117.5897
quadrupole: 14.9972 -12.6065 9.3605
quadrupole: 8.2618 -11.2533 2.9915 14.9972 -12.6065 9.3605
hfenergy: -1218.4679096 hartree
pointgroup: C01 [X(C14H13N1O3S1)]
dipole: 1.5074833 1.4777938 -1.4433134 debye
polarizability: 210.8200447|-9.95776|171.5878902|-0.4015677|-0.6367944|205.2508035 unknown
InChI: InChI=1S/C14H13NO3S/c1-11-6-8-13(9-7-11)19(17,18)15-14-5-3-2-4-12(14)10-16/h2-10,15H,1H3
charge 0 multiplicity 1
32 atoms
S  0.313552 -2.111156 0.261848
O  0.794305 -2.947854 1.568707
O  -0.144198 -2.847001 -1.112459
O  -2.966285 1.857012 3.196155
N  -1.051482 -1.127854 0.984902
C  1.603487 -0.813534 -0.18244
C  -1.902583 -0.231709 0.306102
C  2.411988 -0.317743 0.852941
C  1.730686 -0.427581 -1.525268
C  3.559744 1.076766 -0.829319
C  -2.581916 0.799589 1.04454
C  3.392963 0.63793 0.512413
C  2.719379 0.531808 -1.836099
C  -2.108037 -0.329248 -1.098745
C  -3.482518 1.664732 0.362339
C  4.639504 2.081351 -1.184028
C  -2.973764 0.570192 -1.749791
C  -3.677255 1.566078 -1.024382
C  -2.337349 1.021215 2.487149
H  -1.236101 -1.464781 1.934473
H  2.291968 -0.676387 1.880167
H  1.09513 -0.872546 -2.296966
H  4.039102 1.045008 1.298187
H  2.840662 0.856863 -2.87547
H  -1.633234 -1.140951 -1.658129
H  -3.996054 2.423996 0.962932
H  4.348159 2.704122 -2.047301
H  4.865521 2.751694 -0.337135
H  5.580584 1.564513 -1.454501
H  -3.124976 0.472472 -2.830778
H  -4.364198 2.244407 -1.539848
H  -1.512285 0.418597 2.942105
