program: Gaussian 09
title: 000274225
version: EM64L-G09RevD.01
frameworkgroup: C1[X(C11H15N2O5PS)]
method: RPBEPBE
basis: SDD
operation: Freq
keyword: #p
keyword: freq=noraman
keyword: PBEPBE/SDD
title: #p freq=noraman PBEPBE/SDD
converged: YES YES NO NO
title: Mulliken charges:
elementType: S P O O O O O N N C C C C C C C C C C C H H H H H H H H H H H H H H H
charge: 0.165766 1.341169 -0.466095 -0.447801 -0.530923 -0.184093 -0.189737 0.131381 -0.879272 0.208477 -0.325854 -0.330480 -0.677679 0.592363 -0.394491 -0.335996 -0.206784 -0.220681 -0.250304 -0.834987 0.276929 0.202154 0.217493 0.277206 0.250006 0.255014 0.220998 0.349958 0.274271 0.253696 0.234923 0.236064 0.278288 0.248557 0.260465
chargesum: 0.00000
title: Mulliken charges with hydrogens summed into heavy atoms:
elementType: S P O O O O O N N C C C C C C C C C C C
charge: 0.165766 1.341169 -0.466095 -0.447801 -0.530923 -0.184093 -0.189737 0.131381 -0.529314 0.208477 0.153229 0.164218 0.048339 0.592363 -0.394491 -0.061726 0.046912 0.014242 -0.014240 -0.047677
polarizability: 2.17511485e+02 4.74739345e+00 1.95552215e+02 1.70491656e+01 1.17522603e+01 1.50014128e+02
1716.lowfreq: -11.4292 0.0008 0.0013 0.0016 6.7965 7.3687 14.4952 22.4602 32.1135
frequency: 13.8247 22.4149 32.0367 43.0770 52.5775 72.6584 99.2856 115.6382 120.2183 143.5590 171.4554 190.7379 204.5664 214.5847 237.3434 243.5914 263.0531 278.4158 314.8927 319.4899 333.9142 360.8005 390.5610 404.2811 409.0199 435.5966 455.7313 510.6337 522.9126 542.2782 550.6925 585.0108 615.0619 634.3141 650.1148 669.2469 683.0089 691.7643 733.1429 761.9571 762.6686 788.8742 833.2848 863.6306 884.4906 889.3071 936.9629 949.4878 964.6010 969.2293 984.9218 985.1918 986.2134 1013.9771 1017.6396 1043.4837 1085.6338 1097.4796 1130.2262 1151.5516 1175.1694 1208.4306 1215.9265 1230.3817 1271.2814 1283.8414 1303.0591 1327.2830 1339.7613 1348.3740 1367.0781 1396.6884 1400.0655 1410.7229 1435.4030 1438.7028 1441.0877 1443.3083 1458.7540 1469.0620 1475.2525 1480.4701 1582.0127 1602.3015 2990.3633 2997.2939 3002.2945 3009.5031 3098.5767 3106.4104 3112.8545 3116.9127 3130.4225 3135.2349 3141.4415 3144.3748 3154.7167 3172.3156 3363.8675
redmass: 5.1204 5.7764 11.3514 3.6938 6.2987 7.2810 4.2958 5.6986 4.2480 1.1206 6.0197 1.2343 3.9591 6.9889 3.1623 3.6866 4.7625 5.3512 5.4365 3.9306 7.4497 2.5822 7.9595 6.0158 5.5284 8.4240 3.1901 4.2968 5.5307 3.3468 5.6871 7.0460 7.0960 6.8428 7.8515 2.5452 5.7367 2.8887 2.9705 2.7062 2.3238 2.7383 3.2251 1.4578 4.7413 1.9593 3.6170 1.3717 1.1765 3.4961 1.4033 1.6266 1.3020 2.0431 6.6373 2.0715 3.5813 16.8094 1.6376 2.2540 1.0817 1.4392 11.3109 1.5690 1.9807 1.2350 1.8988 1.6969 1.3241 1.2171 1.2483 1.2316 2.6800 2.6813 1.4430 2.1217 1.1488 1.0635 1.0651 1.0874 2.3432 1.0542 5.7226 6.4720 1.0653 1.0420 1.0600 1.0280 1.1001 1.1012 1.0968 1.0990 1.1049 1.0859 1.1049 1.0896 1.0953 1.1008 1.0746
irintensity: 1.4507 0.9222 0.0537 2.1227 2.9796 1.7792 0.7449 1.2281 1.4129 0.3596 0.7433 0.3397 0.3759 0.5309 2.1900 0.2743 7.7971 7.4149 0.0556 1.7994 39.3968 27.8079 5.2891 3.1005 4.6511 62.8709 10.3683 15.8825 4.7326 1.5230 11.7839 1.8229 90.8355 2.1657 50.9905 50.2383 24.5605 26.0798 4.2412 47.5051 51.9897 90.2732 11.6674 0.5566 155.7253 8.2148 9.6812 2.6042 6.6867 167.2434 6.1330 3.8891 12.4262 100.4960 10.6533 12.9951 5.9048 154.2331 4.7856 4.8361 0.4897 3.2146 80.3107 1.7310 0.7749 9.9318 96.2478 99.9704 28.6431 13.7639 0.6355 23.8591 28.9439 129.9664 22.7893 12.5764 19.3359 14.4050 8.4084 4.6363 177.0927 26.4305 6.0698 80.5749 19.0267 2.6103 50.2608 25.5170 13.0899 5.6777 2.0345 1.7187 18.7532 3.0299 8.7166 4.7731 9.3752 17.8231 155.9391
temp: 298.150 k
press: 1.00000 atm
elementType: 16 15 8 8 8 8 8 7 7 6 6 6 6 6 6 6 6 6 6 6 1 1 1 1 1 1 1 1 1 1 1 1 1 1 1
symmnumber: 1
zpe: 677166.0 jmol-1
zpe.correction: 0.257919 hartree
zpe.thermalcorrener: 0.278942 hartree
zpe.thermalcorrenthalpy: 0.279886 hartree
zpe.thermalcorrgfe: 0.205357 hartree
zpe.sumelectzpe: -1651.459734 hartree
zpe.sumelectthermal: -1651.438711 hartree
zpe.sumelectthermalent: -1651.437767 hartree
zpe.sumelectthermalfe: -1651.512296 hartree
dipole: -3.5455 6.9027 -6.0606
dipole: 9.8462
quadrupole: -144.7700 -128.7461 -139.3498
quadrupole: 13.8417 -0.3477 3.7562
quadrupole: -7.1481 8.8759 -1.7279 13.8417 -0.3477 3.7562
hfenergy: -1651.7176529 hartree
pointgroup: C01 [X(C11H15N2O5P1S1)]
dipole: 1.4284468 2.9823132 2.017843 debye
polarizability: 218.0374587|-2.9377073|192.0834237|16.4799128|-16.8251423|152.9569458 unknown
InChI: InChI=1S/C11H15N2O5PS/c1-11(13(14)15)7-17-19(16,18-8-11)12-9-5-3-4-6-10(9)20-2/h3-6,12H,7-8H2,1-2H3
charge 0 multiplicity 1
35 atoms
S  3.187815 1.919118 -1.314196
P  -0.518785 -1.014207 -1.109121
O  -1.56816 0.189653 -1.802274
O  -1.191643 -1.237863 0.487192
O  -0.44192 -2.370326 -1.904306
O  -4.61788 0.416169 -0.720729
O  -4.272571 -0.573898 1.299947
N  -3.909769 0.166568 0.317713
N  0.905372 -0.03745 -0.861981
C  -2.524892 0.906349 0.456768
C  -2.009511 1.312377 -0.941885
C  -1.545187 -0.008126 1.226283
C  -2.826598 2.175379 1.290609
C  2.078968 -0.42909 -0.166934
C  3.239176 0.396989 -0.262853
C  2.134442 -1.608001 0.623768
C  4.426982 0.03509 0.406316
C  3.325319 -1.951745 1.294702
C  4.477817 -1.138672 1.191162
C  2.597885 3.170312 -0.014146
H  -2.810861 1.791054 -1.52421
H  -1.169709 2.021032 -0.794938
H  -0.630307 0.575214 1.451719
H  -2.0061 -0.372441 2.156078
H  -3.541512 2.830224 0.763338
H  -3.257259 1.901217 2.268494
H  -1.896401 2.743926 1.465367
H  1.057508 0.745501 -1.519743
H  1.255599 -2.256512 0.706893
H  5.3100 0.673865 0.299286
H  3.353125 -2.867866 1.894607
H  5.403347 -1.416855 1.704585
H  3.364274 3.27267 0.767783
H  1.645643 2.835176 0.425772
H  2.460894 4.127869 -0.540568
