program: Gaussian 09
title: 000274217
version: EM64L-G09RevD.01
frameworkgroup: C1[X(C16H14ClNO2)]
method: RPBEPBE
basis: SDD
operation: Freq
keyword: #p
keyword: freq=noraman
keyword: PBEPBE/SDD
title: #p freq=noraman PBEPBE/SDD
converged: YES YES NO NO
title: Mulliken charges:
elementType: Cl O O N C C C C C C C C C C C C C C C C H H H H H H H H H H H H H H
charge: -0.069066 -0.275291 -0.463455 -0.068063 0.372033 0.189022 -0.319457 -0.348695 -0.300028 -0.139143 -0.243770 0.065240 -0.217528 0.255381 -0.322174 -0.377824 -0.286859 -0.235131 -0.217072 -0.534676 0.258755 0.245124 0.263527 0.254820 0.246441 0.260504 0.211453 0.277147 0.230880 0.229010 0.224938 0.247532 0.224701 0.361724
chargesum: 0.00000
title: Mulliken charges with hydrogens summed into heavy atoms:
elementType: Cl O O N C C C C C C C C C C C C C C C C
charge: -0.069066 -0.275291 -0.101731 -0.068063 0.372033 0.189022 -0.060703 -0.103571 -0.036501 -0.139143 0.011050 0.065240 0.028913 0.255381 -0.061671 -0.166370 -0.009712 -0.004251 0.011939 0.162495
polarizability: 5.24162813e+02 2.18718834e+01 2.33125890e+02 -4.70178936e-01 -1.80287909e+00 7.97429950e+01
1716.lowfreq: -0.0008 0.0009 0.0011 1.2869 2.6577 5.6350 14.9292 34.1885 34.5818
frequency: 14.7853 34.1841 34.5625 70.7305 79.2888 102.5560 130.2309 137.7722 153.9607 161.5936 222.1581 228.0395 242.9383 262.4358 296.7025 313.9480 342.8414 348.5548 360.8602 375.8491 392.6395 424.8045 463.1749 474.0395 477.6059 549.2566 554.8558 556.6781 566.7979 601.2677 620.9062 632.7971 724.6979 734.4223 735.9617 753.2301 759.5366 800.9387 842.8873 848.4001 881.3907 896.9633 897.2865 924.5196 935.3698 972.6254 978.3026 986.4694 1014.3010 1034.6903 1076.1581 1081.5284 1114.4707 1114.6464 1143.5091 1149.3231 1159.9089 1168.8036 1189.3798 1209.5678 1227.3831 1242.1483 1265.6122 1273.9012 1280.2624 1296.1783 1355.2334 1381.8620 1388.1200 1407.0352 1436.9130 1439.9893 1465.1600 1470.5536 1476.1077 1480.5266 1539.6276 1571.0278 1574.9032 1593.7151 1604.1623 1625.8858 2964.8226 3053.9373 3055.0116 3102.4457 3121.8078 3128.8361 3133.5958 3141.0203 3157.5939 3161.3579 3172.0036 3174.8363 3181.0777 3563.7475
redmass: 5.1372 6.5075 5.4094 3.7446 3.8441 8.7375 3.9831 2.5580 4.9717 4.5307 6.6581 4.0010 1.1987 5.0057 3.1548 6.1372 3.5937 7.1504 3.8002 5.5266 1.2505 5.9432 3.0020 4.5207 3.2265 7.3618 4.6309 3.6681 4.0260 5.5009 7.1543 5.0923 3.2548 3.9760 4.3813 1.2681 5.7187 1.4999 1.4690 6.2659 1.4378 3.2491 2.6203 1.3498 1.3667 1.4522 1.3381 8.6740 1.1930 2.1512 2.2807 2.1086 1.2611 2.2350 1.4351 1.4349 2.2419 1.1074 1.6712 2.0583 3.1598 2.0905 1.6178 1.4530 1.4808 1.5463 1.9575 5.6472 4.1835 3.4187 1.6366 1.7006 1.6719 1.0496 2.1235 1.4533 5.8514 7.1273 6.1144 6.8939 6.5383 5.5212 1.0327 1.0890 1.1042 1.0891 1.0939 1.0998 1.0859 1.0875 1.0934 1.0875 1.0917 1.0997 1.0966 1.0657
irintensity: 0.2669 0.3898 2.7220 0.3538 1.3171 1.0158 9.3682 0.1043 0.7394 0.0032 1.2244 6.3263 0.1152 8.6118 0.9929 1.4316 3.0846 2.0139 0.2242 3.1307 137.5848 13.4799 4.4988 4.5549 0.2447 7.5296 18.8377 11.8499 1.2785 8.5571 16.1308 8.7223 0.9849 0.9764 0.5995 111.5231 7.5220 51.2448 1.7825 46.3479 13.4148 22.7292 14.4304 0.2777 3.8063 1.8886 1.6024 47.2080 80.0716 9.6792 72.2744 4.8297 0.4907 61.9330 43.5655 9.3038 17.4873 9.2848 9.6195 36.8997 164.2322 22.6907 2.3227 31.8014 41.3121 8.3996 29.9767 9.2597 32.4047 31.0420 56.5321 9.2736 144.5129 14.1538 17.0693 15.3909 47.9741 7.5722 11.4789 40.0110 8.6918 29.2117 93.6345 7.8194 44.1491 21.5503 5.4349 18.1290 27.6851 6.2131 22.1029 8.5532 1.2475 28.8908 8.2289 26.3524
temp: 298.150 k
press: 1.00000 atm
elementType: 17 8 8 7 6 6 6 6 6 6 6 6 6 6 6 6 6 6 6 6 1 1 1 1 1 1 1 1 1 1 1 1 1 1
symmnumber: 1
zpe: 675091.6 jmol-1
zpe.correction: 0.257129 hartree
zpe.thermalcorrener: 0.275822 hartree
zpe.thermalcorrenthalpy: 0.276766 hartree
zpe.thermalcorrgfe: 0.207861 hartree
zpe.sumelectzpe: -1281.900609 hartree
zpe.sumelectthermal: -1281.881916 hartree
zpe.sumelectthermalent: -1281.880972 hartree
zpe.sumelectthermalfe: -1281.949877 hartree
dipole: -0.5155 5.8754 -0.0439
dipole: 5.8981
quadrupole: -90.0699 -105.7522 -130.7989
quadrupole: 8.7847 0.8563 -0.6362
quadrupole: 18.8038 3.1214 -21.9252 8.7847 0.8563 -0.6362
hfenergy: -1282.1577376 hartree
pointgroup: C01 [X(C16H14Cl1N1O2)]
dipole: -0.0986656 1.6765414 1.6013057 debye
polarizability: 524.4539508|21.4341767|161.1273923|-9.929721|75.3317397|151.450355 unknown
InChI: InChI=1S/C16H14ClNO2/c1-20-16-9-8-13(17)11-12(16)5-4-10-18-14-6-2-3-7-15(14)19/h2-11,19H,1H3
charge 0 multiplicity 1
34 atoms
Cl 4.784042 -2.11583 -2.770241
O  3.022132 1.91762 1.348178
O  -3.532438 1.481341 1.151634
N  -2.365172 -0.557062 -0.702477
C  2.480163 0.239943 -0.283666
C  3.492345 0.99509 0.40297
C  2.909865 -0.709299 -1.253413
C  4.864974 0.798451 0.123451
C  1.068709 0.470105 0.030397
C  4.274929 -0.888716 -1.516321
C  5.26621 -0.149722 -0.843292
C  -3.73816 -0.368129 -0.433276
C  -0.012103 -0.183916 -0.518324
C  -4.360148 0.589857 0.440553
C  -4.610808 -1.251357 -1.136177
C  -5.765131 0.641219 0.584844
C  -1.378019 0.122083 -0.137196
C  -6.010065 -1.207314 -0.994361
C  -6.592876 -0.252947 -0.12731
C  4.007756 2.714298 2.082955
H  2.170828 -1.301591 -1.799144
H  5.633472 1.373132 0.647179
H  0.878138 1.244842 0.783349
H  6.325691 -0.305703 -1.064225
H  0.099509 -0.973963 -1.271986
H  -4.126273 -1.973815 -1.800332
H  -6.212937 1.383915 1.259963
H  -1.53543 0.913073 0.61403
H  -6.641741 -1.905608 -1.552438
H  -7.679903 -0.201778 -0.004298
H  4.680399 2.06903 2.680274
H  3.415004 3.353265 2.753477
H  4.605521 3.345656 1.397648
H  -4.079284 2.096326 1.702175
