program: Gaussian 09
title: 000274195
version: EM64L-G09RevD.01
frameworkgroup: C1[X(C16H13NO3S)]
method: RPBEPBE
basis: SDD
operation: Freq
keyword: #p
keyword: freq=noraman
keyword: PBEPBE/SDD
title: #p freq=noraman PBEPBE/SDD
converged: YES YES NO NO
title: Mulliken charges:
elementType: S O O O N C C C C C C C C C C C C C C C C H H H H H H H H H H H H H
charge: 0.218208 -0.278163 -0.187567 -0.257335 -0.194848 -0.442179 0.634945 -0.409160 -0.239542 -0.084938 -0.326786 -0.248295 -0.227407 -0.244342 0.214967 0.206396 -0.342809 -0.338269 -0.221277 -0.222423 -0.220763 0.274819 0.224853 0.238042 0.250669 0.240605 0.247957 0.231850 0.235031 0.267468 0.298596 0.233015 0.236429 0.232254
chargesum: 0.00000
title: Mulliken charges with hydrogens summed into heavy atoms:
elementType: S O O O N C C C C C C C C C C C C C C C C
charge: 0.218208 -0.278163 -0.187567 -0.257335 -0.194848 0.057493 0.634945 -0.409160 0.249168 -0.084938 -0.086181 -0.000338 0.004443 -0.009311 0.214967 0.206396 -0.075340 -0.039673 0.011738 0.014006 0.011491
polarizability: 2.38123399e+02 -3.66159753e+01 2.15666251e+02 -1.92658395e+01 3.16356081e+00 1.46332812e+02
1716.lowfreq: -7.2108 -3.8183 -0.0020 -0.0016 -0.0016 2.3536 14.1306 22.6327 28.1368
frequency: 14.0795 22.4731 28.1298 57.9705 74.8312 86.9114 111.6198 128.4849 165.0519 205.4655 206.6910 247.7376 284.2165 309.1862 332.7351 358.2300 404.5948 405.7393 426.9382 438.4724 442.1756 455.4524 473.0520 488.9546 538.3585 550.6685 612.8535 620.1165 662.7098 669.1113 680.6213 687.0697 704.3166 723.5383 752.2998 774.9560 796.7601 818.5884 848.6898 854.6827 869.8330 931.2748 935.1388 961.1979 976.2223 981.6117 989.2796 1001.1729 1013.3658 1018.4128 1024.1417 1037.5830 1043.1859 1067.0683 1090.2261 1100.3543 1131.0395 1172.3332 1174.1138 1185.8247 1187.7322 1213.6174 1239.7504 1273.8444 1299.3169 1319.4754 1338.0517 1359.2821 1379.9226 1389.6181 1398.9600 1438.3356 1443.3461 1455.1880 1467.9406 1469.8725 1478.6664 1584.3529 1588.6550 1602.6278 1611.0814 1623.0677 1668.9196 3006.0948 3023.8754 3070.9795 3094.6328 3130.1943 3138.9452 3143.4279 3149.6542 3154.5921 3160.7921 3165.1584 3173.9179 3175.1211
redmass: 6.4210 6.1976 8.1941 5.2789 6.8953 6.7047 8.1807 4.6561 4.1672 4.8355 4.5604 6.0415 4.3514 6.0935 3.9518 3.7494 2.8583 12.4991 3.5978 4.1439 3.6911 9.8105 7.3064 4.7653 3.9894 4.4835 6.4462 6.9591 6.4956 6.3929 5.1209 6.6297 1.6233 3.2341 1.3877 3.6744 2.1399 6.6853 1.3727 4.0335 1.2424 1.3868 2.7341 1.4092 1.3151 3.2173 6.2201 1.3763 1.3316 3.1035 2.5472 3.6255 2.4781 3.4185 1.8868 2.3063 1.6615 1.1911 1.0614 1.7109 1.1665 1.2104 3.4838 1.3270 2.2816 1.3141 2.1639 1.3969 1.4865 9.7030 4.9176 2.2480 2.0915 1.2576 2.3585 1.1653 2.2122 6.5599 7.0021 7.0019 6.0564 10.6571 11.6280 1.0576 1.0626 1.1068 1.1016 1.0856 1.0855 1.0889 1.0896 1.0934 1.0952 1.0970 1.1004 1.1006
irintensity: 0.1624 2.0483 2.4253 0.9861 1.4958 0.5629 0.8173 0.8245 0.7264 2.9739 1.4787 5.3633 0.8395 9.9095 7.4381 3.0057 0.2343 17.6579 16.6424 4.6786 0.3164 5.3284 4.6512 4.1847 4.7445 6.3053 0.1023 6.7243 5.5861 3.8247 12.5374 10.4904 95.5349 5.7225 101.3583 12.5893 23.0775 14.3718 0.4046 5.3781 0.2156 2.0983 3.0342 5.1960 0.0436 27.9827 1.4949 0.0953 0.8395 24.1665 50.8892 1.5840 15.2267 255.8789 45.0665 13.1100 7.8012 14.8372 2.3851 60.1868 44.4464 3.9787 358.6613 9.9667 52.4711 1.3716 33.4673 6.4446 1.8578 3.3270 0.9496 19.1720 4.8262 20.1110 108.6619 31.9745 5.2101 31.7160 11.5388 25.5913 17.0063 170.5485 544.0070 10.9212 32.5523 22.5370 7.9104 1.1295 1.3023 11.6834 8.3120 12.1736 17.4736 9.3654 25.0983 14.2574
temp: 298.150 k
press: 1.00000 atm
elementType: 16 8 8 8 7 6 6 6 6 6 6 6 6 6 6 6 6 6 6 6 6 1 1 1 1 1 1 1 1 1 1 1 1 1
symmnumber: 1
zpe: 667438.0 jmol-1
zpe.correction: 0.254214 hartree
zpe.thermalcorrener: 0.272166 hartree
zpe.thermalcorrenthalpy: 0.273110 hartree
zpe.thermalcorrgfe: 0.205026 hartree
zpe.sumelectzpe: -1294.542596 hartree
zpe.sumelectthermal: -1294.524644 hartree
zpe.sumelectthermalent: -1294.523700 hartree
zpe.sumelectthermalfe: -1294.591784 hartree
dipole: 1.9835 -1.5208 -0.4375
dipole: 2.5374
quadrupole: -108.6891 -130.0459 -126.1496
quadrupole: -13.5609 0.0242 -9.5728
quadrupole: 12.9391 -8.4177 -4.5214 -13.5609 0.0242 -9.5728
hfenergy: -1294.7968098 hartree
pointgroup: C01 [X(C16H13N1O3S1)]
dipole: 0.7941018 0.5651102 0.2160046 debye
polarizability: 239.629117|34.6078623|213.1087911|22.5180806|7.1618457|147.3845534 unknown
InChI: InChI=1S/C16H13NO3S/c18-15(12-6-2-1-3-7-12)20-11-10-17-13-8-4-5-9-14(13)21-16(17)19/h1-9H,10-11H2
charge 0 multiplicity 1
34 atoms
S  2.240045 -2.526024 -0.015305
O  -0.951509 0.907604 -0.791985
O  0.398808 -1.817945 -1.988169
O  -1.997198 2.630103 0.375716
N  1.78477 -0.111506 -1.087635
C  1.183164 0.974865 -1.884402
C  2.813387 0.096671 -0.139941
C  3.201008 -1.09039 0.541759
C  0.175587 1.813903 -1.08992
C  1.294221 -1.420753 -1.215873
C  3.453543 1.322103 0.15062
C  4.216663 -1.07147 1.512755
C  4.476076 1.340323 1.125351
C  4.856206 0.157273 1.803464
C  -2.002886 1.44168 -0.031317
C  -3.072484 0.434067 0.203722
C  -4.201677 0.827215 0.969032
C  -2.985219 -0.885874 -0.314943
C  -5.239275 -0.094018 1.216041
C  -4.028436 -1.801877 -0.063563
C  -5.153991 -1.409902 0.699979
H  0.668945 0.503745 -2.738873
H  1.987278 1.62548 -2.273695
H  -0.183672 2.667436 -1.694458
H  0.591828 2.206746 -0.14485
H  3.170698 2.245301 -0.364576
H  4.508596 -1.98877 2.033157
H  4.977018 2.285821 1.357709
H  5.648577 0.188854 2.557998
H  -4.243776 1.850653 1.356525
H  -2.111292 -1.180192 -0.904253
H  -6.110526 0.208703 1.806769
H  -3.963375 -2.819938 -0.461946
H  -5.960901 -2.126089 0.892407
