program: Gaussian 09
title: 000274154
version: EM64L-G09RevD.01
frameworkgroup: C1[X(C8H10N4O)]
method: RPBEPBE
basis: SDD
operation: Freq
keyword: #p
keyword: freq=noraman
keyword: PBEPBE/SDD
title: #p freq=noraman PBEPBE/SDD
converged: YES YES NO NO
title: Mulliken charges:
elementType: O N N N N C C C C C C C C H H H H H H H H H H
charge: -0.257746 -0.264206 -0.027736 -0.409693 0.001357 0.135240 -0.502975 0.125858 0.175286 0.146156 -0.690507 -0.159577 -0.794315 0.213438 0.239824 0.220343 0.207170 0.249090 0.304682 0.235280 0.240026 0.256031 0.356973
chargesum: 0.00000
title: Mulliken charges with hydrogens summed into heavy atoms:
elementType: O N N N N C C C C C C C C
charge: -0.257746 -0.264206 -0.027736 -0.052720 0.001357 0.135240 -0.049712 0.125858 0.175286 0.146156 -0.013904 0.145106 -0.062978
polarizability: 1.56773271e+02 -6.39455232e-01 1.30294702e+02 5.06104741e+00 2.80683653e+00 6.34760934e+01
1716.lowfreq: -14.5887 -7.0982 0.0006 0.0007 0.0010 4.9834 40.0765 75.9855 120.8629
frequency: 39.1271 75.9781 120.8603 132.4460 165.9553 205.3579 214.6187 281.0222 317.2449 319.3796 323.1702 401.8556 469.1551 491.6200 571.2097 585.1832 596.7586 610.3578 645.9183 695.7339 746.5500 765.4696 781.7648 814.5206 851.7517 920.7725 960.3882 985.6192 1028.6569 1037.2189 1046.8140 1064.9394 1128.4058 1137.5086 1191.6483 1223.8155 1259.7408 1268.3304 1306.4346 1314.6034 1327.8502 1376.0380 1387.9666 1400.1989 1456.9266 1464.5854 1471.3047 1473.3921 1476.3001 1487.5848 1521.2356 1569.4728 1640.2709 2980.5207 2986.8170 3005.0304 3056.5061 3066.1064 3076.6777 3093.1108 3120.3505 3278.3775 3636.5544
redmass: 2.5511 4.1628 1.0570 3.9620 5.3087 4.2758 1.1739 4.5614 2.7648 2.8228 5.7196 5.9012 6.3235 4.4111 1.8904 7.7655 2.7651 3.2765 2.7739 7.7185 3.1698 4.9776 1.5989 1.4694 4.4148 3.0014 2.9617 2.0852 3.1157 1.5680 2.1546 1.9587 2.8679 3.3424 1.8656 3.7415 7.1457 1.3783 4.9601 1.5362 1.7802 1.5046 1.2900 1.9793 1.3303 1.2517 1.1930 1.8260 1.0685 1.0702 5.2378 9.0996 10.1530 1.0351 1.0391 1.0600 1.1006 1.0959 1.1005 1.1012 1.0986 1.1005 1.0832
irintensity: 0.1709 2.9282 0.0935 1.9646 1.4066 0.0997 0.2650 1.7055 1.0744 4.0709 1.7652 3.8965 1.0984 1.1478 73.9954 2.4610 19.2131 8.2303 51.3871 1.2665 9.4747 19.7436 19.3416 24.2382 22.9452 3.1193 7.8030 1.0187 15.1338 5.8201 0.9950 16.6602 15.0986 3.6514 28.1571 13.1753 9.9133 13.8730 26.5396 5.5125 20.9112 29.5256 10.1017 77.4723 28.1329 14.2443 10.9177 1.9710 8.4102 15.3039 43.0818 419.9353 426.9995 38.7246 10.2652 28.4547 5.8750 13.2970 49.0694 32.4980 10.6397 10.9183 142.7382
temp: 298.150 k
press: 1.00000 atm
elementType: 8 7 7 7 7 6 6 6 6 6 6 6 6 1 1 1 1 1 1 1 1 1 1
symmnumber: 1
zpe: 469241.7 jmol-1
zpe.correction: 0.178725 hartree
zpe.thermalcorrener: 0.190467 hartree
zpe.thermalcorrenthalpy: 0.191411 hartree
zpe.thermalcorrgfe: 0.140616 hartree
zpe.sumelectzpe: -604.126626 hartree
zpe.sumelectthermal: -604.114884 hartree
zpe.sumelectthermalent: -604.113939 hartree
zpe.sumelectthermalfe: -604.164734 hartree
dipole: 0.2422 2.6846 0.2811
dipole: 2.7101
quadrupole: -69.9411 -81.4088 -77.0633
quadrupole: -0.2156 0.7321 -0.8761
quadrupole: 6.1966 -5.2711 -0.9256 -0.2156 0.7321 -0.8761
hfenergy: -604.3053507 hartree
pointgroup: C01 [X(C8H10N4O1)]
dipole: 0.1046872 1.0555357 0.1083446 debye
dipolederiv: -0.4697468 -0.003469 -0.0025518 -0.2013393 -1.2942257 -0.1057219 -0.0136775 -0.0722807 -0.364214 -0.6654162 -0.3313885 -0.1100586 0.2236283 -0.6106387 -0.0284196 -0.0658281 -0.0861501 0.0176082 -1.5211336 -0.1209763 -0.1218259 0.4279695 -0.5204359 0.0251912 -0.1151036 -0.0321815 -0.2532176 -0.7776158 0.2593804 -0.0126479 -0.2819944 -0.3692475 -0.0358238 -0.0730684 0.0261962 -0.3123959 -0.3985447 -0.1752463 -0.0345082 0.1280534 0.2998834 0.0518374 -0.0172071 0.0145539 -0.1743632 0.0532577 0.397227 0.0166786 -0.0757009 -0.8648486 -0.0530191 0.0001074 0.0066928 -0.1535467 0.0643913 -0.047444 0.0266409 -0.0690007 0.0862777 -0.0012625 0.1239357 0.0178712 0.08588 1.0391663 0.0806561 0.1289152 0.0774459 0.8312154 0.0533117 0.1413631 0.0404424 0.0264008 0.6995939 -0.023061 0.0574396 0.4004168 1.6152082 0.1579371 0.0709002 0.0928934 0.1988323 1.3173227 -0.123324 0.0969302 -0.7146223 0.398945 -0.0452999 0.0698489 -0.0006583 0.2115082 -0.013354 -0.0079774 0.0216714 0.0049887 0.0705774 0.0348651 -0.0680338 0.0201179 0.0036903 0.3945191 -0.1604842 0.0363067 -0.1689428 0.0650145 -0.01216 0.0357284 -0.0118411 -0.0133792 -0.1761479 0.2215959 -0.0152428 0.1559817 -0.0933858 0.0152573 -0.0412195 0.0601323 0.0438457 -0.0397514 0.04751 -0.041249 0.101176 -0.0341154 0.1195683 -0.0354109 0.0760725 0.0119325 0.0538331 0.0178849 0.0300319 -0.0608368 -0.0127497 -0.1125161 -0.0031419 -0.063336 -0.015802 -0.2196183 -0.1067199 -0.0011396 -0.1112276 0.0676807 0.0029428 0.0034049 0.0014439 0.0656181 0.093346 -0.0241551 0.0047 0.0274518 -0.0621687 -0.1458165 0.0209311 -0.0880126 -0.0416456 0.0630179 0.1132832 -0.0590682 0.0639168 -0.0190481 0.0864355 -0.0402316 0.036221 0.0396592 0.1100528 -0.0178733 -0.0115327 -0.001389 0.1169 -0.0050473 -0.0104664 -0.0075717 0.1955224 -0.0310727 0.0052485 0.0943396 -0.0256978 0.065341 0.0556895 0.1158592 0.0070827 0.0160322 0.0561814 0.0446351 -0.0723723 0.0246291 0.0643498 -0.0226454 -0.0846796 0.0246973 -0.0694891 0.0811022 -0.1198925 -0.0249752 -0.0348334 -0.0501325 -0.0361494 -0.0107426 -0.0607355 0.1067326 0.2866171 0.0745902 -0.0064819 0.109927 0.2496037 0.0008456 -0.0032679 -0.0016501 0.3747907 unknown
polarizability: 156.6397337|-0.9146038|130.3270022|6.0770858|2.5337288|63.5773303 unknown
InChI: InChI=1S/C8H10N4O/c1-3-6-5(2)10-8-11-9-4-12(8)7(6)13/h4,11H,3H2,1-2H3
charge 0 multiplicity 1
23 atoms
O  -0.443485 -2.350158 -0.323349
N  1.060295 -0.567326 -0.027625
N  0.374756 1.769439 0.06817
N  2.668323 0.900121 0.270011
N  3.29589 -0.358481 0.251192
C  -1.285947 -0.044368 -0.26716
C  -2.71776 -0.515432 -0.443782
C  -0.936104 1.316038 -0.120524
C  -0.279897 -1.097727 -0.219136
C  1.294558 0.813774 0.102582
C  -3.360933 -0.964258 0.897387
C  2.290232 -1.225191 0.069435
C  -1.974029 2.41704 -0.163284
H  -3.331056 0.27923 -0.904742
H  -2.719246 -1.378507 -1.13483
H  -4.39907 -1.307744 0.736409
H  -3.381547 -0.137349 1.631168
H  -2.787805 -1.800626 1.333708
H  2.403494 -2.301914 0.00389
H  -2.807549 2.220314 0.534286
H  -2.411308 2.515164 -1.175058
H  -1.498808 3.372916 0.103475
H  3.220696 1.744046 0.397877
