program: Gaussian 09
title: 000026372
version: EM64L-G09RevD.01
frameworkgroup: C1[X(C19H21N2)]
method: RPBEPBE
basis: SDD
operation: Freq
keyword: #p
keyword: freq=noraman
keyword: PBEPBE/SDD
title: #p freq=noraman PBEPBE/SDD
converged: YES YES NO NO
title: Mulliken charges:
elementType: N N C C C C C C C C C C C C C C C C C C C H H H H H H H H H H H H H H H H H H H H H
charge: -0.166333 -0.165978 0.447136 0.446193 -0.367475 -0.364948 -0.139681 -0.367450 -0.363522 -0.138354 -0.665569 -0.665468 -0.204148 -0.200839 -0.245339 -0.204329 -0.201264 -0.246006 -0.227948 -0.114554 -0.228047 0.257505 0.253526 0.271609 0.257311 0.253666 0.271152 0.271587 0.259886 0.261189 0.260241 0.260507 0.271762 0.248809 0.250376 0.254299 0.253837 0.248763 0.250344 0.254345 0.218863 0.254345
chargesum: 1.00000
title: Mulliken charges with hydrogens summed into heavy atoms:
elementType: N N C C C C C C C C C C C C C C C C C C C
charge: -0.166333 -0.165978 0.447136 0.446193 -0.109970 -0.111422 0.131928 -0.110139 -0.109855 0.132798 0.127092 0.127042 0.044661 0.049537 0.008960 0.044434 0.049080 0.007831 0.026397 0.104310 0.026298
polarizability: 6.71693740e+02 -5.41124609e-02 1.96561658e+02 2.03459481e+01 7.01335538e-02 1.32197311e+02
1716.lowfreq: -0.0003 0.0005 0.0007 1.2251 3.5450 10.4127 25.3640 27.9038 30.2170
frequency: 25.3635 27.7816 30.2028 52.6302 72.2391 80.1912 109.9866 111.2391 126.9654 150.6491 160.1369 185.5493 226.1562 236.3671 245.9037 303.9617 331.7023 338.7590 348.8779 389.0314 401.0313 407.7122 408.9431 442.3670 459.0208 504.3864 506.6419 541.3760 569.2065 612.2016 612.5702 625.2725 645.7682 697.9148 698.1989 760.5585 768.9443 771.2026 785.4607 839.0960 839.3746 848.1298 887.1436 901.7923 918.5625 921.9352 945.3696 967.6634 976.5526 976.9901 977.4425 987.8997 988.5101 1004.2274 1005.2682 1005.8419 1026.4755 1026.6349 1090.5982 1090.7815 1110.0361 1110.0681 1121.0013 1122.4227 1181.7444 1181.8028 1191.3510 1191.5456 1198.2804 1216.5540 1247.8544 1260.0504 1271.6197 1282.9409 1291.5362 1321.4092 1321.8976 1356.9210 1363.8437 1378.0558 1387.8561 1391.4473 1436.9970 1440.4688 1447.8871 1450.6513 1470.8465 1476.4134 1477.3449 1478.9167 1484.2646 1490.5231 1551.5841 1594.2534 1594.3503 1598.7465 1600.4912 1618.9432 1639.3502 2996.5540 2997.2154 3081.7952 3082.4508 3082.8026 3137.7715 3138.5093 3140.1216 3141.5966 3142.9911 3143.1498 3146.1493 3146.3957 3149.8001 3150.6605 3156.0242 3156.0441 3165.0804 3165.1336 3180.9731 3181.0193
redmass: 3.7973 4.2214 5.1183 4.0906 3.0915 4.4664 1.9599 2.3294 2.4970 1.5300 2.0392 5.1059 2.1012 4.4943 2.1684 3.1332 3.5483 3.4774 5.0689 2.5972 3.5196 2.8522 3.1098 3.8064 3.9623 3.6082 3.6262 3.3982 3.6990 6.2332 6.3332 4.1053 5.0202 2.0330 2.0158 3.9544 1.6839 1.7577 3.5856 1.2455 1.2452 1.4567 1.8451 1.3673 1.3522 1.3698 1.2766 4.2531 2.1507 1.4377 2.0873 5.1097 5.1763 1.2138 1.3331 1.2639 2.0988 2.1025 1.5474 1.5433 1.3471 1.3433 1.5581 1.5826 1.0522 1.0519 1.1190 1.1267 1.7288 3.6221 1.2764 3.1998 2.7788 1.6692 1.7455 1.3370 1.3328 1.4835 1.7052 3.5654 6.8926 4.8098 1.1862 1.2607 2.2638 2.0836 1.1168 1.6188 1.8035 1.1657 1.1568 1.2353 3.5767 6.2964 6.3653 5.4066 5.8997 4.6496 5.0811 1.0364 1.0364 1.1025 1.1024 1.0907 1.0923 1.0901 1.0905 1.0928 1.0914 1.0909 1.0937 1.0939 1.0906 1.0884 1.0920 1.0920 1.0965 1.0965 1.1017 1.1017
irintensity: 0.0320 0.1223 0.0654 0.0684 1.9025 0.6516 0.0417 0.0446 0.0931 0.0630 1.3437 0.2966 1.1176 0.9249 2.2885 0.6227 3.7496 0.6110 4.6534 0.0005 3.6577 0.2330 0.2501 5.5473 2.3645 5.8062 5.1703 10.6162 10.2857 0.0241 0.1880 5.1209 6.7744 57.2816 32.0401 1.9855 99.2583 31.9235 67.8467 4.6001 0.3991 0.3539 27.1312 4.5029 0.8525 6.5365 0.2363 1.8198 10.5219 4.5083 11.3296 17.6324 0.0428 68.5515 0.2037 36.2762 23.2954 10.1306 9.8666 4.6171 22.1153 4.8043 5.6796 54.9896 0.3188 0.1221 17.5743 7.1264 11.4305 4.9850 620.2363 94.9972 3.8897 0.0198 70.3404 2.5690 36.3891 0.4414 447.1553 0.3338 86.6569 0.4193 9.2134 19.2140 9.2826 0.5393 6.4947 40.0643 120.4664 15.8303 75.6858 0.9426 1166.7526 165.5221 18.0534 474.1454 2.0351 1616.9740 0.6584 29.4089 28.6021 10.8670 10.4018 5.1411 13.6666 1.0796 1.8333 3.6412 6.8397 3.3719 1.3504 1.6473 1.1349 9.0462 2.5737 2.7370 12.4395 12.1645 23.7962 3.5103
temp: 298.150 k
press: 1.00000 atm
elementType: 7 7 6 6 6 6 6 6 6 6 6 6 6 6 6 6 6 6 6 6 6 1 1 1 1 1 1 1 1 1 1 1 1 1 1 1 1 1 1 1 1 1
symmnumber: 1
zpe: 921323.5 jmol-1
zpe.correction: 0.350914 hartree
zpe.thermalcorrener: 0.370863 hartree
zpe.thermalcorrenthalpy: 0.371807 hartree
zpe.thermalcorrgfe: 0.300172 hartree
zpe.sumelectzpe: -844.393238 hartree
zpe.sumelectthermal: -844.373289 hartree
zpe.sumelectthermalent: -844.372345 hartree
zpe.sumelectthermalfe: -844.443980 hartree
dipole: -0.0064 2.3579 0.0057
dipole: 2.3579
quadrupole: -0.3926 -96.1678 -121.7378
quadrupole: 0.0264 5.8651 0.0385
quadrupole: 72.3735 -23.4017 -48.9717 0.0264 5.8651 0.0385
hfenergy: -844.7441521 hartree
pointgroup: C01 [X(C19H21N2)]
dipole: 0.0058985 -0.9276093 -0.0101785 debye
polarizability: 671.9005048|1.9260436|196.5596775|-17.2700999|0.7317703|131.9925267 unknown
InChI: InChI=1S/C19H21N2/c1-20(18-12-6-3-7-13-18)16-10-5-11-17-21(2)19-14-8-4-9-15-19/h3-17H,1-2H3
charge 1 multiplicity 1
42 atoms
N  3.714086 -0.878972 -0.012042
N  -3.704163 -0.907085 -0.025478
C  4.868567 -0.001146 0.05578
C  -4.864451 -0.035791 -0.067879
C  4.871406 1.092212 0.958009
C  5.986203 -0.243473 -0.780458
C  2.454582 -0.367822 0.004769
C  -4.874631 1.084127 -0.936927
C  -5.980923 -0.310461 0.759973
C  -2.44803 -0.387024 -0.031367
C  3.925743 -2.347199 -0.083919
C  -3.906278 -2.377745 0.014778
C  5.989415 1.952005 1.00605
C  7.101616 0.617712 -0.716577
C  1.258728 -1.110326 -0.005012
C  -5.997966 1.937849 -0.959033
C  -7.101752 0.54525 0.722088
C  -1.246489 -1.12037 -0.036003
C  7.106871 1.718258 0.171854
C  0.003414 -0.463174 -0.014511
C  -7.113858 1.672298 -0.132278
H  4.03135 1.246567 1.644117
H  5.97725 -1.071822 -1.496713
H  2.399993 0.726569 -0.001729
H  -4.036316 1.26466 -1.618765
H  -5.967388 -1.16019 1.450668
H  -2.401043 0.707305 -0.001869
H  4.997512 -2.564812 0.011467
H  3.552841 -2.753151 -1.041039
H  3.398427 -2.844503 0.749293
H  -3.553913 -2.799142 0.973105
H  -3.35495 -2.855631 -0.813982
H  -4.973723 -2.601081 -0.111453
H  5.995393 2.790201 1.710066
H  7.961197 0.43514 -1.369135
H  1.285769 -2.205515 -0.014126
H  -1.264667 -2.215668 -0.046361
H  -6.009332 2.796759 -1.637575
H  -7.960235 0.337208 1.368444
H  7.975443 2.382359 0.218373
H  -0.001029 0.638844 -0.004404
H  -7.986469 2.332179 -0.158803
