program: Gaussian 09
title: 000274182
version: EM64L-G09RevD.01
frameworkgroup: C1[X(C18H13NO5)]
method: RPBEPBE
basis: SDD
operation: Freq
keyword: #p
keyword: freq=noraman
keyword: PBEPBE/SDD
title: #p freq=noraman PBEPBE/SDD
converged: YES YES NO NO
title: Mulliken charges:
elementType: O O O O O N C C C C C C C C C C C C C C C C C C H H H H H H H H H H H H H
charge: -0.248487 -0.194542 -0.194998 -0.221852 -0.199532 -0.231673 0.180447 0.190723 0.109818 0.115994 -0.467978 -0.352346 -0.354171 -0.211050 -0.210561 0.313197 -0.415519 0.139337 0.289895 -0.337740 -0.338288 -0.240328 -0.224139 -0.218605 0.279138 0.275373 0.270707 0.269740 0.239581 0.239120 0.262610 0.258199 0.240769 0.279310 0.234074 0.237218 0.236559
chargesum: 0.00000
title: Mulliken charges with hydrogens summed into heavy atoms:
elementType: O O O O O N C C C C C C C C C C C C C C C C C C
charge: -0.248487 -0.194542 -0.194998 -0.221852 -0.199532 -0.231673 0.180447 0.190723 0.109818 0.115994 0.086533 -0.081639 -0.084431 0.028530 0.028558 0.313197 0.105290 0.139337 0.289895 -0.096971 -0.058978 -0.006254 0.013079 0.017954
polarizability: 2.56892038e+02 -2.09709991e+01 1.72538191e+02 2.92337164e+00 1.45031514e+01 2.08661453e+02
1716.lowfreq: -4.1817 -2.7327 -0.0008 -0.0006 0.0001 5.3813 13.0970 17.4789 22.5621
frequency: 12.4707 17.2220 22.2662 35.4767 52.2246 61.5441 90.8601 94.6678 138.3576 149.9677 164.8174 178.3817 224.1756 246.5332 255.7211 272.4994 310.8114 314.0934 356.6302 382.0365 397.3778 409.6745 414.1462 455.1383 457.0554 515.1191 525.4477 552.0129 566.3358 609.7389 612.8912 632.0633 658.9322 680.7049 688.0981 694.5968 703.0383 730.8524 763.3861 786.5392 788.4098 793.4516 799.6194 837.9358 856.6362 907.0641 935.7665 943.8347 952.1490 974.6727 975.2737 989.5070 990.2971 994.0991 1006.6392 1012.9039 1019.7930 1025.0074 1041.8064 1072.2253 1088.4272 1094.3914 1168.5524 1172.0179 1174.9587 1181.4773 1192.0059 1211.1806 1236.1299 1242.5838 1283.3595 1295.9053 1317.0364 1334.3940 1338.6136 1365.9504 1389.0882 1416.3455 1421.6676 1434.2498 1437.5982 1454.2499 1456.2513 1481.6036 1578.5325 1603.6088 1614.6887 1617.9988 1620.2444 1633.8403 1662.0067 1682.7668 3005.1369 3015.0676 3086.1827 3094.8406 3130.7259 3138.6728 3139.3225 3149.5462 3153.1024 3159.9519 3164.8950 3171.1541 3174.5562
redmass: 6.1630 6.4210 5.3241 6.5951 6.0460 6.3013 8.9260 8.4461 5.0933 5.5084 6.4823 6.0848 3.2342 5.3161 4.8341 3.8644 7.9516 9.9030 7.7561 6.3063 2.8064 3.2304 3.2759 4.8970 6.6155 4.6276 6.3798 4.0202 3.5289 7.4134 6.5492 6.8282 4.8215 7.0761 5.4672 1.8117 4.6695 3.3887 1.9415 5.2177 4.1046 3.1956 2.3179 4.8590 1.2521 1.3959 1.4376 3.2925 6.4077 4.0745 1.5287 5.0761 1.6162 2.0566 1.3478 1.4178 2.0244 2.4154 3.6516 2.5836 1.6129 2.9740 1.2520 1.9979 1.1108 3.2555 1.1703 3.2722 3.2770 1.1266 1.4685 1.3963 1.3723 1.4534 1.5537 4.2811 9.1259 5.5502 1.1186 1.1168 2.2630 2.4774 2.7866 2.2035 6.4803 6.6801 7.6759 7.6162 7.8128 12.1134 10.6578 12.0687 1.0606 1.0610 1.1002 1.1006 1.0852 1.0882 1.0864 1.0923 1.0907 1.0963 1.0956 1.1015 1.1004
irintensity: 0.5151 0.4305 1.0112 0.5594 0.7701 1.7258 1.1834 4.1427 0.0684 0.5991 8.1140 0.2681 2.6989 2.5857 4.7268 8.1914 5.0457 13.0056 3.9823 18.5678 0.1147 0.9247 0.4302 0.0979 8.6163 13.5687 11.0170 2.1814 7.3799 22.9313 1.4801 22.2137 0.0297 2.9702 0.8902 51.6486 23.0738 76.2106 71.0843 0.3935 2.3899 27.2889 6.4638 3.0449 0.7707 0.0132 3.8440 60.0225 155.6501 10.8759 3.6182 4.0047 0.5870 4.8178 0.0053 0.7286 0.3120 1.7919 23.5329 19.4910 8.0745 29.5329 24.9411 16.3003 28.4649 308.8230 3.8266 69.3519 68.2722 7.9339 4.7424 46.2452 8.6484 73.0487 32.8912 234.9182 2.2219 6.2120 28.3013 34.4958 23.3487 12.0602 1.1050 1.0768 58.4241 62.8064 1.8627 6.3906 65.5808 386.4181 224.1635 53.1892 32.7416 17.0600 4.9782 3.2930 1.2933 5.4220 1.8005 16.8470 5.6001 16.2492 5.5723 22.2897 20.2764
temp: 298.150 k
press: 1.00000 atm
elementType: 8 8 8 8 8 7 6 6 6 6 6 6 6 6 6 6 6 6 6 6 6 6 6 6 1 1 1 1 1 1 1 1 1 1 1 1 1
symmnumber: 1
zpe: 711394.5 jmol-1
zpe.correction: 0.270956 hartree
zpe.thermalcorrener: 0.291279 hartree
zpe.thermalcorrenthalpy: 0.292223 hartree
zpe.thermalcorrgfe: 0.217580 hartree
zpe.sumelectzpe: -1122.941303 hartree
zpe.sumelectthermal: -1122.920979 hartree
zpe.sumelectthermalent: -1122.920035 hartree
zpe.sumelectthermalfe: -1122.994679 hartree
dipole: -0.1009 -5.5395 -1.4197
dipole: 5.7194
quadrupole: -91.6223 -135.4752 -143.6704
quadrupole: -0.6514 3.1914 4.8636
quadrupole: 31.9670 -11.8859 -20.0811 -0.6514 3.1914 4.8636
hfenergy: -1123.2122584 hartree
pointgroup: C01 [X(C18H13N1O5)]
dipole: -0.2775792 -1.825419 -1.2861341 debye
polarizability: 252.3274076|-27.0302254|171.0354166|-7.9161682|1.1346306|214.7288577 unknown
InChI: InChI=1S/C18H13NO5/c20-15(12-6-2-1-3-7-12)11-24-16(21)10-19-17(22)13-8-4-5-9-14(13)18(19)23/h1-9H,10-11H2
charge 0 multiplicity 1
37 atoms
O  -0.348744 0.670109 -0.094052
O  2.607363 -0.092577 2.538493
O  2.356849 1.584107 -1.85281
O  -0.820601 2.930239 0.25607
O  -2.213608 0.461198 1.869803
N  2.28375 1.000468 0.449505
C  3.627167 -0.899005 0.409741
C  3.558581 -0.389886 -0.91064
C  2.810673 -0.017577 1.303525
C  2.689949 0.830446 -0.905983
C  1.377762 2.046305 0.901901
C  4.372483 -2.047558 0.714236
C  4.234652 -1.012593 -1.970242
C  5.058778 -2.686131 -0.351504
C  4.991298 -2.176194 -1.673053
C  -0.03609 1.964384 0.325743
C  -1.738294 0.468634 -0.519382
C  -2.664069 0.298369 0.704191
C  -4.095175 -0.05775 0.443518
C  -4.622155 -0.198848 -0.869699
C  -4.950818 -0.255873 1.561892
C  -5.979933 -0.5331 -1.057684
C  -6.305065 -0.59089 1.372053
C  -6.82288 -0.730394 0.061033
H  1.299543 1.956587 2.002396
H  1.771064 3.046982 0.656867
H  4.417268 -2.43116 1.738224
H  4.175838 -0.610044 -2.986277
H  5.650317 -3.586193 -0.152835
H  5.532307 -2.690001 -2.474888
H  -2.076973 1.330667 -1.125841
H  -1.719359 -0.443311 -1.137739
H  -3.986425 -0.044823 -1.748617
H  -4.52562 -0.138516 2.564247
H  -6.382122 -0.637711 -2.071023
H  -6.958349 -0.742621 2.237889
H  -7.876959 -0.989837 -0.087657
