program: Gaussian 09
title: 000274136
version: EM64L-G09RevD.01
frameworkgroup: C1[X(C13H5I3O3)]
method: RPBEPBE
basis: SDD
operation: Freq
keyword: #p
keyword: freq=noraman
keyword: PBEPBE/SDD
title: #p freq=noraman PBEPBE/SDD
converged: NO NO NO YES
title: Mulliken charges:
elementType: I I I O O O C C C C C C C C C C C C C H H H H H
charge: 0.219957 0.170945 0.156812 -0.260679 -0.374006 -0.214960 0.435767 0.447383 0.367972 0.390399 -0.450883 -0.359723 -0.723946 -0.365789 -0.750413 0.618114 -0.621932 -0.324555 0.253505 0.267593 0.260972 0.241863 0.262395 0.353209
chargesum: 0.00000
title: Mulliken charges with hydrogens summed into heavy atoms:
elementType: I I I O O O C C C C C C C C C C C C C
charge: 0.219957 0.170945 0.156812 -0.260679 -0.020797 -0.214960 0.435767 0.447383 0.367972 0.390399 -0.183290 -0.098750 -0.723946 -0.123927 -0.750413 0.618114 -0.621932 -0.062160 0.253505
polarizability: 4.79411650e+02 2.13015681e+01 2.74099212e+02 1.17136961e-02 1.00952049e-02 6.79167739e+01
1716.lowfreq: -6.4010 -3.1955 -0.0002 0.0003 0.0006 3.8283 19.1552 46.5173 52.8173
frequency: 19.1429 46.5131 52.8173 73.4045 94.5079 94.8003 97.4743 126.8627 179.2272 201.6514 206.2866 242.2489 243.1556 262.4858 299.1707 331.8430 343.3461 395.7940 419.6060 456.7569 474.2261 503.0284 506.8463 520.1420 554.3797 584.4566 611.7415 625.4582 650.8475 664.4793 732.3626 751.5606 762.4417 770.8800 826.6084 860.6885 879.8352 885.2878 919.3942 943.0236 978.7730 1005.8232 1087.3772 1136.0277 1169.8423 1185.9768 1210.1014 1230.9265 1261.5392 1298.0119 1368.1069 1384.3421 1395.8442 1415.5570 1447.9268 1508.2037 1526.6368 1543.8674 1580.2349 1594.7979 1634.9564 3132.1489 3142.8892 3165.5798 3168.4192 3439.6201
redmass: 23.5450 11.7485 70.2111 10.2687 38.0438 29.3353 6.8002 8.0931 23.6083 16.1191 5.7800 10.9972 7.3841 8.7508 6.6350 7.1775 9.1307 8.9609 4.2821 1.1258 7.9052 4.6796 6.8712 4.2514 5.1821 9.4948 7.6617 4.1342 8.7478 6.7275 8.1367 8.6192 4.8650 5.1451 1.7275 1.4459 9.1969 6.1918 1.5777 6.7856 1.3368 5.2334 2.6071 2.4018 2.2059 2.0392 1.4815 1.8517 3.0375 3.7758 2.7239 2.6485 6.4519 5.6530 5.7333 8.6683 8.3344 10.1453 7.8963 7.2645 8.2306 1.0886 1.0923 1.0928 1.0976 1.0650
irintensity: 0.1727 1.2441 0.0617 1.0309 0.3530 0.1982 5.3842 2.9201 0.0155 2.6212 0.1141 2.0982 0.0279 0.7030 6.1353 0.0057 6.5858 13.7462 0.0921 126.6149 42.5377 0.9244 11.4442 2.7854 17.8620 10.2076 0.3214 4.7165 9.3260 1.0509 27.8299 1.5398 1.5271 20.3384 39.8760 0.4292 50.3148 106.1189 45.7559 3.8859 0.1725 26.4771 113.3904 1.7768 213.5688 31.3662 175.6819 72.1568 3.2892 94.9303 6.2148 148.5468 0.4456 2.2112 70.9894 435.9474 30.2780 85.7269 193.3705 53.6450 61.8033 5.6673 9.1449 0.2645 11.3284 195.5082
temp: 298.150 k
press: 1.00000 atm
elementType: 53 53 53 8 8 8 6 6 6 6 6 6 6 6 6 6 6 6 6 1 1 1 1 1
symmnumber: 1
zpe: 372208.0 jmol-1
zpe.correction: 0.141767 hartree
zpe.thermalcorrener: 0.158876 hartree
zpe.thermalcorrenthalpy: 0.159820 hartree
zpe.thermalcorrgfe: 0.092271 hartree
zpe.sumelectzpe: -757.245950 hartree
zpe.sumelectthermal: -757.228840 hartree
zpe.sumelectthermalent: -757.227896 hartree
zpe.sumelectthermalfe: -757.295445 hartree
dipole: -8.6791 3.0360 -0.0004
dipole: 9.1948
quadrupole: -171.7657 -130.3369 -155.8740
quadrupole: -9.8397 -0.0041 0.0007
quadrupole: -19.1068 22.3220 -3.2151 -9.8397 -0.0041 0.0007
hfenergy: -757.3877161 hartree
pointgroup: C01 [X(C13H5I3O3)]
dipole: 2.8550568 2.2214692 0.0001551 debye
dipolederiv: 0.1256918 -0.0818607 0.0000334 0.017403 -0.294067 0.0000506 -0.0000206 -0.0000376 0.1000165 0.070836 0.0016998 0.0000183 -0.2059919 -0.3853566 0.0000298 0.0001298 -0.0000218 0.0604318 -0.4329022 -0.1936478 -0.0000344 -0.2237614 -0.171455 -0.0000225 -0.000271 -0.0001847 0.0662967 -1.3388671 -0.1596162 -0.0000188 0.2631285 -0.0482346 0.0000046 -0.0001644 0.0001214 -0.1393267 -1.5363133 0.319516 0.000003 0.9024204 -0.4025444 0.0000146 0.0000358 -0.0000214 -0.3610901 -1.4334758 -0.0614459 0.0001236 -0.4659576 -0.3714547 0.0000529 -0.0004171 0.000063 -0.3280458 -0.9129646 0.0265528 -0.000025 0.4411789 -0.1878949 -0.0000324 0.0000259 0.0000241 0.0047306 -0.746408 -0.1301359 0.0000025 -0.1366564 0.0778008 0.0000369 -0.0000963 -0.0000235 0.0486597 0.8721194 -0.0618706 0.0000295 -0.0206362 -0.0298144 0.0000743 0.0000181 -0.0000146 0.1925667 1.3856135 0.2419588 0.0000568 -0.0613779 -0.2617235 -0.0000159 0.0002395 -0.0001569 0.1653694 1.0963171 -0.0187772 0.0000197 -0.4719481 0.0510212 -0.0000133 0.0001522 0.0000076 -0.1100628 0.4883535 0.0066879 0.0000014 -0.3160932 -0.0709887 -0.0000602 -0.0000459 -0.0000635 -0.0545737 -0.5463441 0.3315329 -0.0000217 -0.2746955 0.8236938 -0.0001118 0.0002274 0.0000461 -0.2479508 0.5111636 0.0117264 -0.0000039 -0.0908396 0.0877302 -0.0001023 0.0001389 0.0000398 -0.140842 -1.1751424 0.0573199 -0.0001006 0.6610805 0.7937429 -0.0000648 -0.0003665 0.0000293 -0.2573425 0.7308492 -0.5547706 -0.0000418 -1.2146775 0.0205868 0.0000116 -0.0003793 0.000005 0.1864132 0.6994411 0.3903548 0.0000504 1.476638 0.0871283 0.0000384 0.0003776 0.0002031 -0.2257605 -0.0718771 0.0174643 0.0000172 -0.5976546 -0.1600818 0.00001 0.0000728 0.0000281 -0.1275648 1.4963321 -0.1175204 -0.0000662 0.3020398 0.2295954 -0.0000207 0.000398 -0.0001002 0.193649 0.0664595 -0.0159207 -0.0000072 0.0348256 -0.0572996 0.0000118 -0.0000259 0.0000084 0.1460581 0.1160801 0.0168289 0.0000142 -0.0218964 -0.0202722 0.0000573 -0.000004 0.000032 0.1578447 0.0834539 -0.0657139 -0.0000174 0.0481278 -0.0939867 0.0000389 0.0000178 0.0000018 0.153338 -0.0126567 0.0784134 -0.0000078 0.0237851 0.0018851 0.0000179 -0.0000475 0.000021 0.1587811 0.4642403 -0.038776 -0.0000253 -0.0684411 0.3819896 -0.0000055 0.0000047 -0.0000065 0.3584044 unknown
polarizability: 471.3942156|45.1171432|282.1166463|0.0143224|-0.0058303|67.9167739 unknown
InChI: InChI=1S/C13H5I3O3/c14-7-4-6-3-5-1-2-8(17)9(15)12(5)19-13(6)10(16)11(7)18/h1-4,18H
charge 0 multiplicity 1
24 atoms
I  1.801111 -3.271332 0.000161
I  -2.896583 -2.888744 -0.00001
I  5.448231 1.686194 0.000012
O  -0.352066 -0.908879 0.000015
O  4.406656 -1.461562 0.000135
O  -5.172204 -0.536601 -0.000471
C  1.044711 1.112809 -0.000036
C  -1.412794 1.332179 -0.000098
C  0.907487 -0.312954 0.000017
C  -1.530878 -0.124916 -0.000034
C  -0.150105 1.916353 -0.000103
C  2.353045 1.667912 -0.000037
C  2.031168 -1.164066 0.000076
C  -2.642362 2.101845 -0.000279
C  -2.752054 -0.771923 0.000007
C  3.333151 -0.592722 0.000076
C  3.47327 0.831348 0.000019
C  -3.866119 1.480413 -0.000256
C  -4.016791 0.003479 0.000187
H  -0.05641 3.008125 -0.000172
H  2.470103 2.754949 -0.000083
H  -2.565125 3.195259 -0.000492
H  -4.804166 2.045552 -0.000459
H  5.272324 -0.96712 0.000126
