program: Gaussian 09
title: 000274127
version: EM64L-G09RevD.01
frameworkgroup: C1[X(C16H12O7)]
method: RPBEPBE
basis: SDD
operation: Freq
keyword: #pfreq=noraman
keyword: PBEPBE/SDD
title: #p freq=noraman PBEPBE/SDD
converged: YES YES NO NO
title: Mulliken charges:
elementType: O O O O O O O C C C C C C C C C C C C C C C C H H H H H H H H H H H H
charge: -0.378972 -0.389096 -0.379026 -0.382813 -0.214524 -0.402578 -0.249582 0.294061 0.314071 0.298647 -0.600156 0.096747 0.102209 -0.475414 -0.398847 -0.345968 -0.006194 -0.042151 -0.418739 0.169649 -0.340524 0.023232 0.205292 0.244687 0.262184 0.260549 0.277232 0.274322 0.235702 0.231961 0.252727 0.372330 0.358877 0.366396 0.383709
chargesum: 0.00000
title: Mulliken charges with hydrogens summed into heavy atoms:
elementType: O O O O O O O C C C C C C C C C C C C C C C C
charge: -0.378972 -0.016766 -0.020149 -0.016417 -0.214524 -0.018869 -0.249582 0.294061 0.314071 0.298647 -0.093286 0.096747 0.102209 0.062367 -0.124525 -0.110265 -0.006194 -0.042151 -0.186778 0.169649 -0.087797 0.023232 0.205292
polarizability: 3.89146229e+02 -4.43312706e+01 2.26771451e+02 -1.79706529e+01 -1.87454049e+01 1.06800809e+02
1716.lowfreq: -0.0005 -0.0002 0.0003 5.2408 7.1966 9.1818 24.8211 32.1039 51.2523
frequency: 24.8114 32.0048 51.2504 61.3709 75.3036 91.4776 111.3003 141.9255 159.1660 162.2844 210.6579 253.2103 260.0354 282.4220 290.6420 297.0608 308.1001 323.8434 332.2852 335.5683 363.9433 378.1012 405.8321 428.4163 434.5033 458.8871 463.3663 507.0684 519.5217 529.4055 532.5799 555.2676 581.0008 590.9789 597.9306 600.2932 610.1890 658.4328 672.7081 695.7572 724.8999 736.6824 754.5783 769.2792 791.4715 809.2988 821.8615 862.0511 914.7528 921.7948 953.5300 966.1453 976.2024 1010.3737 1024.1603 1039.0519 1082.9713 1117.1883 1138.6161 1161.1339 1164.4573 1180.6128 1191.1181 1203.4450 1226.3382 1233.4763 1263.9917 1275.1281 1304.1639 1319.2490 1328.5225 1362.8913 1370.9600 1382.0152 1396.6782 1437.0721 1440.5473 1449.4002 1486.0280 1501.7085 1518.7054 1552.8425 1570.6169 1586.9573 1619.7866 1645.6982 1658.4131 2993.3062 3033.8468 3079.9464 3090.7840 3130.8322 3144.5406 3169.3306 3182.0069 3510.7733 3556.6397 3563.4341 3576.4436
redmass: 6.2518 7.9173 7.4006 6.0592 6.1045 5.5237 6.8510 6.9842 8.4273 6.4166 4.8823 5.5352 3.7685 4.3103 5.8335 2.8464 7.6879 3.8438 1.9353 8.6302 2.7197 1.2019 1.1489 4.6940 3.9443 6.4521 4.1510 2.8427 6.3829 5.7538 6.3033 5.2529 3.0897 4.0180 4.8692 4.9023 5.8288 1.4900 3.1673 6.1580 5.6901 5.8914 4.7377 3.7372 1.6943 4.7255 1.9240 4.2208 3.4981 1.3390 2.7847 1.2981 3.1088 2.8049 3.6199 3.2168 2.3483 2.4093 1.8507 1.8752 1.5461 2.0540 1.5001 1.4786 1.4694 1.5766 1.6330 2.9345 1.6868 1.9284 1.7394 2.2990 1.9154 2.9095 4.4870 4.1299 1.3648 3.6277 2.6966 1.8539 2.4653 7.5669 8.3072 8.5024 6.2923 8.1260 8.0187 1.0665 1.0624 1.0970 1.0964 1.0903 1.0859 1.0978 1.0937 1.0640 1.0650 1.0648 1.0662
irintensity: 1.5594 0.7854 0.5187 0.9518 1.1862 3.9977 3.7974 1.9021 0.7904 4.4055 0.0477 1.1806 0.3270 4.2779 17.8977 6.6097 8.0909 9.0366 11.0726 3.2739 13.1647 40.1918 326.1975 4.9330 22.6189 16.0373 2.9413 40.8715 0.5880 0.2126 1.3841 28.9031 13.0498 6.5160 3.3749 42.5217 4.7895 119.3519 19.0472 3.3485 4.0074 2.3756 4.0972 15.9738 43.1669 3.0085 39.7772 7.6824 75.6727 6.4824 6.1432 0.3290 29.8842 50.5204 103.0266 76.7629 180.0613 384.0552 25.9863 371.2738 2.1291 85.3148 110.3222 1.1198 84.0085 8.3238 23.3458 50.6217 21.6124 44.8132 9.7558 1.5158 59.3452 117.3951 2.5143 18.0916 2.5179 94.5341 207.7817 191.0513 79.8784 15.4635 60.2690 162.5172 265.6763 1.6200 182.5272 13.5379 17.0162 2.0879 7.3011 16.1818 3.6428 16.7090 4.8611 32.4866 5.7303 49.0738 121.9180
temp: 298.150 k
press: 1.00000 atm
elementType: 8 8 8 8 8 8 8 6 6 6 6 6 6 6 6 6 6 6 6 6 6 6 6 1 1 1 1 1 1 1 1 1 1 1 1
symmnumber: 1
zpe: 655958.2 jmol-1
zpe.correction: 0.249841 hartree
zpe.thermalcorrener: 0.270176 hartree
zpe.thermalcorrenthalpy: 0.271120 hartree
zpe.thermalcorrgfe: 0.200368 hartree
zpe.sumelectzpe: -1141.811058 hartree
zpe.sumelectthermal: -1141.790723 hartree
zpe.sumelectthermalent: -1141.789779 hartree
zpe.sumelectthermalfe: -1141.860531 hartree
dipole: 8.5683 3.4925 -1.2371
dipole: 9.3351
quadrupole: -158.7459 -123.1609 -130.3145
quadrupole: -5.3531 7.0610 0.1248
quadrupole: -21.3388 14.2462 7.0926 -5.3531 7.0610 0.1248
hfenergy: -1142.0608989 hartree
pointgroup: C01 [X(C16H12O7)]
dipole: -3.291308 1.5380205 -0.5391063 debye
polarizability: 256.8069485|-75.9937286|358.8112017|28.5728299|-9.9248939|107.1003394 unknown
InChI: InChI=1S/C16H12O7/c17-10-4-1-8-7(3-6-12(19)20)9-2-5-11(18)14(22)16(9)23-15(8)13(10)21/h1-2,4-5,17,19,21-22H,3,6H2
charge 0 multiplicity 1
35 atoms
O  1.761638 0.627466 0.221131
O  2.243737 3.304582 0.504714
O  3.882707 -1.048295 0.817572
O  0.287496 5.148696 0.046748
O  3.553389 -3.816722 0.574537
O  -4.232846 -0.873215 2.043226
O  -4.331931 0.545501 0.211502
C  -0.796137 -0.430491 -0.612874
C  -0.600411 1.007165 -0.450773
C  0.276382 -1.299418 -0.33847
C  -2.136793 -0.988747 -1.071951
C  0.68182 1.49065 -0.047441
C  1.562609 -0.78156 0.096301
C  -3.016819 -1.551731 0.082351
C  -1.608603 1.992031 -0.670688
C  0.19505 -2.747789 -0.454102
C  0.982078 2.858216 0.116575
C  2.657524 -1.570802 0.404106
C  -1.334964 3.358726 -0.510175
C  -0.04529 3.80741 -0.123407
C  1.264687 -3.560619 -0.153657
C  2.572724 -3.042878 0.30046
C  -3.898261 -0.504115 0.739079
H  -1.957486 -1.802601 -1.79515
H  -2.717218 -0.223538 -1.61229
H  -3.706602 -2.319285 -0.323738
H  -2.412147 -2.053375 0.855688
H  -2.623063 1.685445 -0.934041
H  -0.743864 -3.199224 -0.787671
H  -2.131043 4.093688 -0.680051
H  1.19648 -4.650265 -0.242073
H  2.842485 2.524314 0.629955
H  3.831543 -0.059201 0.855032
H  -0.491002 5.731152 -0.13985
H  -4.846872 -0.19507 2.437323
