program: Gaussian 09
title: 000274166
version: EM64L-G09RevD.01
frameworkgroup: C1[X(C18H18N2O6)]
method: RPBEPBE
basis: SDD
operation: Freq
keyword: #p
keyword: freq=noraman
keyword: PBEPBE/SDD
title: #p freq=noraman PBEPBE/SDD
converged: YES YES NO NO
title: Mulliken charges:
elementType: O O O O O O N N C C C C C C C C C C C C C C C C C C H H H H H H H H H H H H H H H H H H
charge: -0.284385 -0.294412 -0.201021 -0.296860 -0.211289 -0.208310 -0.375733 0.023364 -0.361518 -0.414624 -0.503484 0.222229 -0.477370 0.464523 0.317930 0.369498 -0.369356 -0.385780 -0.279151 -0.369520 0.380490 -0.346403 -0.329555 -0.228822 -0.226435 -0.232986 0.263738 0.223593 0.259921 0.211973 0.243153 0.270537 0.325118 0.245161 0.221417 0.272418 0.232905 0.312094 0.268407 0.288928 0.290879 0.230027 0.227778 0.230933
chargesum: 0.00000
title: Mulliken charges with hydrogens summed into heavy atoms:
elementType: O O O O O O N N C C C C C C C C C C C C C C C C C C
charge: -0.284385 -0.294412 -0.201021 -0.296860 -0.211289 -0.208310 -0.050615 0.023364 0.125813 0.057269 0.010207 0.222229 -0.010792 0.464523 0.317930 0.369498 -0.096937 -0.152875 0.032943 -0.101113 0.380490 -0.057475 -0.038676 0.001205 0.001343 -0.002053
polarizability: 2.75751082e+02 6.00030353e+01 2.10847329e+02 1.16416775e+01 -8.73825429e+00 2.13500178e+02
1716.lowfreq: -9.1961 -3.4808 -0.7495 -0.0008 -0.0004 -0.0004 5.2540 7.9342 18.8633
frequency: -7.2342 6.1819 18.7567 20.7207 35.7903 39.7491 45.5618 65.4218 69.3301 72.9172 85.2018 119.7661 139.5213 142.5949 164.1239 193.6558 209.0525 251.7093 264.7434 269.0400 309.9165 315.8463 344.0011 361.5793 404.1932 415.4301 418.6529 427.2160 482.6995 495.5750 506.8288 525.6771 529.7741 539.0163 597.5138 611.8491 617.7513 618.8950 632.7450 665.6031 697.6077 700.1350 705.6303 734.0790 740.0461 757.5493 767.8389 802.2587 816.1761 821.1252 843.2725 857.2157 873.7647 876.5043 891.2818 919.1264 935.1205 963.1123 979.5197 982.5455 986.7986 990.4389 999.7511 1000.2927 1000.8871 1027.2449 1057.3886 1079.2666 1091.2218 1093.9633 1101.5018 1109.9569 1115.1770 1155.0520 1169.3370 1173.6413 1188.8902 1194.3057 1201.6674 1222.5731 1222.7299 1239.4377 1262.2745 1275.5423 1289.8486 1312.5276 1330.2352 1346.9611 1357.0241 1360.8326 1374.4391 1385.5823 1400.9629 1423.8168 1438.4132 1442.7251 1451.9141 1460.2888 1469.3040 1471.7006 1480.6398 1485.2645 1589.9827 1594.3074 1606.8586 1614.6359 1657.8850 1670.1395 2984.8448 3004.0687 3013.6629 3032.8481 3036.2167 3065.8515 3083.6121 3109.6849 3119.4507 3128.4543 3140.4647 3151.3239 3165.3195 3171.0087 3181.0668 3191.7075 3217.5441 3578.0143
redmass: 5.4126 7.1319 5.8620 5.5716 8.0971 6.1443 5.7221 4.7773 7.4243 8.4644 3.5229 2.8458 6.1550 6.1205 6.3053 5.4158 4.1230 6.8072 6.4396 4.1957 6.8205 3.6875 5.6526 2.3108 2.8019 3.0100 7.3639 3.3175 3.4630 3.1315 7.3025 1.3059 3.8342 2.1416 3.9978 7.1866 6.2452 7.9498 5.2715 4.7722 5.2095 4.9287 2.0930 4.8537 7.3209 2.0691 1.7979 7.2985 3.5084 2.6464 1.2726 1.2499 1.6121 3.7005 3.9165 3.1537 1.5053 2.2307 1.8583 1.6767 1.3340 5.3508 2.8886 1.3385 1.3620 2.2134 3.8384 2.3333 1.5272 3.0969 2.4807 1.3060 4.2824 1.7695 1.2784 1.0544 1.1380 2.0697 2.2790 2.8768 6.4474 1.1565 1.4041 1.1534 1.2748 1.2828 1.2584 1.2319 1.4790 7.8806 1.3707 8.0230 11.0001 3.9241 1.0941 2.1709 1.1602 1.1401 2.1079 1.1564 1.7771 2.1796 7.5449 6.0888 6.9784 6.0847 8.3831 10.3353 1.0605 1.0603 1.0628 1.0970 1.0585 1.1034 1.1025 1.1074 1.0869 1.0871 1.0920 1.0964 1.1016 1.0895 1.0914 1.0969 1.0951 1.0779
irintensity: 0.1240 0.1958 0.7283 0.7093 2.1520 0.7499 2.2494 1.0347 0.2379 8.5650 0.7040 1.0303 3.5804 4.0101 0.3816 4.3799 3.9200 9.5949 9.3062 8.3913 0.2352 5.4423 3.6116 17.6505 0.0578 0.0260 0.1438 1.5117 2.7733 11.2902 1.3336 150.6245 3.1709 39.4809 16.6114 6.0321 0.6571 3.5356 3.2501 22.1452 5.6070 15.7151 85.3800 6.3138 25.3954 43.9066 22.9640 12.5375 10.6731 10.0779 4.3604 0.6783 94.1202 34.5925 58.9937 94.9384 7.4348 44.0204 53.1411 49.8859 0.1709 2.8682 4.2698 0.4896 0.1164 2.6314 725.3741 27.2998 6.5087 22.0216 123.1275 32.5409 127.6373 217.5180 4.6623 0.0345 15.1710 127.8984 177.7780 10.2870 350.3864 5.6726 59.7323 7.4058 3.6325 64.9700 1.7178 14.1240 11.4523 82.8145 15.6849 0.6792 28.4076 45.8280 25.2785 8.7629 48.8968 11.3310 82.2316 16.3149 245.6352 71.5377 56.4883 1.5427 87.2959 0.3062 184.3862 175.6326 19.1010 36.0563 27.0393 2.2460 38.6806 15.0105 26.7746 5.5093 6.3698 1.4498 17.8024 23.8601 19.2331 0.8992 1.6350 2.8881 3.9503 35.2992
temp: 298.150 k
press: 1.00000 atm
elementType: 8 8 8 8 8 8 7 7 6 6 6 6 6 6 6 6 6 6 6 6 6 6 6 6 6 6 1 1 1 1 1 1 1 1 1 1 1 1 1 1 1 1 1 1
symmnumber: 1
zpe: 879550.0 jmol-1
zpe.correction: 0.335003 hartree
zpe.thermalcorrener: 0.358513 hartree
zpe.thermalcorrenthalpy: 0.359457 hartree
zpe.thermalcorrgfe: 0.276016 hartree
zpe.sumelectzpe: -1255.611034 hartree
zpe.sumelectthermal: -1255.587524 hartree
zpe.sumelectthermalent: -1255.586579 hartree
zpe.sumelectthermalfe: -1255.670020 hartree
dipole: -4.9908 -2.5020 -3.7484
dipole: 6.7245
quadrupole: -205.3017 -138.6439 -146.7710
quadrupole: -14.4036 6.6946 6.2664
quadrupole: -41.7295 24.9283 16.8012 -14.4036 6.6946 6.2664
hfenergy: -1255.9460365 hartree
pointgroup: C01 [X(C18H18N2O6)]
dipole: 1.7123967 -1.7023121 1.0812818 debye
polarizability: 245.6103798|-69.1486839|236.9059419|-3.0167663|12.842734|217.5822671 unknown
InChI: InChI=1S/C18H18N2O6/c21-17(26-16-10-8-15(9-11-16)20(23)24)7-4-12-19-18(22)25-13-14-5-2-1-3-6-14/h1-3,5-6,8-11,19H,4,7,12-13H2
charge 0 multiplicity 1
44 atoms
O  -1.872466 -0.908774 0.555293
O  4.662959 -1.811427 0.650782
O  -1.392916 -1.08094 -1.751615
O  4.00995 -2.09873 -1.607703
O  -6.758739 2.887983 2.020889
O  -6.734867 3.204084 -0.239095
N  2.887923 -3.147295 0.165652
N  -6.276523 2.665736 0.842309
C  0.782977 -2.929509 -1.212536
C  1.911054 -3.847098 -0.686425
C  -0.040149 -2.301733 -0.073333
C  -1.139319 -1.38701 -0.573538
C  5.705921 -0.822445 0.208814
C  5.167019 0.592018 0.20587
C  3.855969 -2.33364 -0.379317
C  -2.967339 -0.009187 0.502752
C  4.53748 1.117723 -0.95279
C  5.283276 1.40845 1.35972
C  -3.489866 0.593899 -0.670576
C  -3.523349 0.260091 1.778406
C  -5.129503 1.737694 0.726153
C  -4.581764 1.475459 -0.547445
C  -4.611533 1.137943 1.897162
C  4.029776 2.435793 -0.952286
C  4.776036 2.727049 1.361193
C  4.148083 3.243473 0.203581
H  1.228097 -2.137357 -1.839596
H  0.123888 -3.523356 -1.873452
H  2.445781 -4.278695 -1.551511
H  1.489489 -4.681912 -0.096015
H  -0.508056 -3.075144 0.567746
H  0.613605 -1.709145 0.596656
H  2.887854 -3.269937 1.178072
H  6.0556 -1.128348 -0.792145
H  6.503926 -0.958117 0.955611
H  4.440693 0.483104 -1.840864
H  5.771398 1.00906 2.257513
H  -3.056131 0.378277 -1.64655
H  -3.087619 -0.225818 2.655565
H  -5.013406 1.961237 -1.426408
H  -5.063093 1.366402 2.865533
H  3.546647 2.83424 -1.851407
H  4.873426 3.350726 2.256868
H  3.757417 4.267378 0.201366
