program: Gaussian 09
title: 000274100
version: EM64L-G09RevD.01
frameworkgroup: C1[X(C9H16ClNO3)]
method: RPBEPBE
basis: SDD
operation: Freq
keyword: #p
keyword: freq=noraman
keyword: PBEPBE/SDD
title: #p freq=noraman PBEPBE/SDD
converged: YES YES NO NO
title: Mulliken charges:
elementType: Cl O O O N C C C C C C C C C H H H H H H H H H H H H H H H H
charge: -0.056729 -0.299434 -0.230628 -0.261908 -0.232522 -0.165830 0.247075 -0.305230 -0.693543 -0.685818 0.290915 -0.593730 -0.247110 -0.662673 0.274903 0.270866 0.261515 0.219362 0.234541 0.209564 0.220654 0.225228 0.239572 0.293644 0.279005 0.228709 0.238148 0.223543 0.250439 0.227475
chargesum: 0.00000
title: Mulliken charges with hydrogens summed into heavy atoms:
elementType: Cl O O O N C C C C C C C C C
charge: -0.056729 -0.299434 -0.230628 -0.261908 -0.232522 0.109072 0.247075 0.227151 -0.030076 -0.000365 0.290915 -0.021082 0.219747 0.038784
polarizability: 1.47997542e+02 1.27270797e+00 1.38325315e+02 -4.92719491e+00 2.28514336e-01 9.05737500e+01
1716.lowfreq: -9.9382 0.0024 0.0026 0.0028 2.9985 4.1504 19.2882 40.9556 43.6487
frequency: 16.9376 40.9317 43.6313 57.3436 77.2913 89.7327 97.5058 129.1450 156.6961 175.6060 203.1937 211.3543 216.0154 245.3732 276.0130 300.9336 328.8834 364.6501 383.0070 415.1400 424.0841 455.4855 593.2988 644.4516 698.1225 702.0497 725.3649 749.2186 776.9079 808.4774 819.6117 870.7497 926.4358 935.3822 962.8358 1006.9775 1021.0124 1055.1904 1071.3424 1094.8211 1097.7881 1120.5934 1128.6653 1154.3330 1173.4694 1185.4278 1260.3933 1263.5427 1278.8234 1280.7828 1332.7693 1349.4193 1359.8061 1373.9488 1378.5819 1390.5296 1396.7096 1450.2321 1454.5114 1457.2932 1462.3382 1463.8947 1466.4645 1477.6743 1483.3186 1486.4537 1604.6482 1633.5848 2987.5051 2990.7264 2993.6901 3034.7045 3052.4602 3065.5492 3075.6615 3084.0056 3087.0123 3089.0740 3095.5959 3098.2725 3102.0544 3122.2472 3137.7055 3163.3787
redmass: 3.3061 4.9284 6.4559 3.6218 3.6397 2.5256 4.4916 3.8433 3.1696 1.0867 3.3566 1.2361 1.5565 2.5173 2.8319 3.0377 3.2233 4.1800 6.5335 3.0548 3.6477 3.8600 6.3571 3.4937 7.5528 6.4121 5.0562 3.1207 1.2862 1.5195 2.3618 2.9496 1.2516 2.2473 1.3887 3.0211 1.6634 4.0312 4.1125 2.0975 1.6968 2.4953 1.9264 1.7123 2.1697 3.0896 1.8426 1.2172 1.1245 1.3327 1.3184 1.4199 1.4007 1.2874 1.2359 1.2356 1.2102 1.0899 1.0953 1.0957 1.0478 1.0463 1.0475 1.0535 1.0514 1.0541 8.4285 9.6111 1.0347 1.0358 1.0360 1.0596 1.0843 1.0583 1.0570 1.1003 1.1003 1.0974 1.1028 1.0999 1.0988 1.1069 1.1063 1.1122
irintensity: 0.9063 1.3936 0.6417 0.0763 0.0759 2.1810 0.5275 4.0618 4.4311 0.1476 2.4417 0.6293 1.2804 2.4509 2.2614 5.8039 17.7491 10.9504 7.9804 1.1146 3.6222 7.0106 42.1512 0.8425 10.6446 15.6176 10.3759 20.8647 7.0829 2.5479 2.7892 11.6272 4.8194 28.8480 6.1818 147.2508 20.9375 127.2455 28.4195 59.2601 26.8138 45.9737 434.6325 4.3401 16.8663 22.1100 167.3594 27.2419 3.2549 7.1419 56.9936 52.7746 61.9232 24.5910 17.9197 25.1376 32.4352 16.2437 20.5358 34.4440 9.6882 15.0903 0.7227 13.0922 14.7797 21.7658 82.9057 341.3334 26.7974 29.8163 15.2951 27.7954 3.3687 1.4084 17.8503 20.3544 20.7617 35.3089 2.0690 29.5556 28.8792 26.7811 0.6767 4.7329
temp: 298.150 k
press: 1.00000 atm
elementType: 17 8 8 8 7 6 6 6 6 6 6 6 6 6 1 1 1 1 1 1 1 1 1 1 1 1 1 1 1 1
symmnumber: 1
zpe: 641897.3 jmol-1
zpe.correction: 0.244486 hartree
zpe.thermalcorrener: 0.261430 hartree
zpe.thermalcorrenthalpy: 0.262374 hartree
zpe.thermalcorrgfe: 0.197347 hartree
zpe.sumelectzpe: -1091.940692 hartree
zpe.sumelectthermal: -1091.923748 hartree
zpe.sumelectthermalent: -1091.922804 hartree
zpe.sumelectthermalfe: -1091.987831 hartree
dipole: -0.0369 4.0354 0.0742
dipole: 4.0363
quadrupole: -94.5010 -96.2654 -88.4252
quadrupole: 9.3989 0.5331 -0.4225
quadrupole: -1.4371 -3.2015 4.6386 9.3989 0.5331 -0.4225
hfenergy: -1092.1851776 hartree
pointgroup: C01 [X(C9H16Cl1N1O3)]
dipole: 0.7405002 -1.3833523 -0.2444261 debye
polarizability: 146.7538789|2.4506177|137.3562758|5.4906879|10.187943|92.7864526 unknown
InChI: InChI=1S/C9H16ClNO3/c1-4-14-9(13)11(6-5-10)8(12)7(2)3/h7H,4-6H2,1-3H3
charge 0 multiplicity 1
30 atoms
Cl 1.958089 3.880836 0.894043
O  2.017452 -0.604257 0.635171
O  -2.025496 1.56645 0.416775
O  0.268304 -1.974665 -0.078863
N  -0.10469 0.28683 0.595551
C  -2.318523 -0.778328 -0.216996
C  -1.506316 0.428876 0.257752
C  0.544132 1.499454 1.187316
C  -3.569295 -0.303136 -0.985671
C  -2.710087 -1.632995 1.026328
C  0.674883 -0.864566 0.342129
C  1.120036 2.39684 0.084065
C  2.963382 -1.743449 0.406017
C  3.419916 -1.786984 -1.053435
H  -1.689647 -1.412059 -0.863592
H  -0.232273 2.049611 1.740148
H  1.339983 1.17789 1.872648
H  -3.296561 0.289051 -1.877337
H  -4.210179 0.329803 -0.348853
H  -4.153291 -1.180796 -1.317212
H  -3.306343 -1.03361 1.738415
H  -3.323235 -2.491014 0.698825
H  -1.820853 -2.032184 1.542745
H  0.334408 2.810947 -0.563028
H  1.906063 1.89201 -0.494871
H  3.792622 -1.522239 1.096287
H  2.458935 -2.680021 0.700211
H  4.180241 -2.579995 -1.179054
H  2.573717 -2.014911 -1.722868
H  3.873427 -0.82709 -1.355545
