program: Gaussian 09
title: 000274124
version: EM64L-G09RevD.01
frameworkgroup: C1[X(C21H16O7)]
method: RPBEPBE
basis: SDD
operation: Freq
keyword: #pfreq=noraman
keyword: PBEPBE/SDD
title: #p freq=noraman PBEPBE/SDD
converged: NO YES NO NO
title: Mulliken charges:
elementType: O O O O O O O C C C C C C C C C C C C C C C C C C C C C H H H H H H H H H H H H H H H H
charge: -0.436850 -0.220578 -0.381163 -0.387638 -0.377648 -0.383440 -0.212183 -0.235136 -0.295860 -0.242618 -0.273525 -0.549606 -0.209189 -0.237689 0.365745 0.140914 0.275433 0.238121 0.093924 0.099975 -0.380985 -0.287798 -0.012705 -0.060099 -0.418448 -0.392292 0.166801 0.015900 0.266692 0.288027 0.270025 0.296725 0.250917 0.265786 0.252091 0.260127 0.233332 0.250620 0.387448 0.227419 0.252898 0.372687 0.358594 0.365248
chargesum: 0.00000
title: Mulliken charges with hydrogens summed into heavy atoms:
elementType: O O O O O O O C C C C C C C C C C C C C C C C C C C C C
charge: -0.049402 -0.220578 -0.381163 -0.014951 -0.019054 -0.018192 -0.212183 0.031556 -0.007833 0.027407 0.023200 -0.032904 0.042902 0.022438 0.365745 0.140914 0.275433 0.238121 0.093924 0.099975 -0.147654 -0.037178 -0.012705 -0.060099 -0.191028 -0.139394 0.166801 0.015900
polarizability: 2.99869185e+02 2.20883180e+01 4.17603543e+02 -7.80531541e+00 1.19532142e+01 1.53346118e+02
1716.lowfreq: -10.8142 -6.3956 -3.3365 -0.0001 0.0005 0.0007 23.9452 29.3847 40.0532
frequency: 23.6047 29.3515 40.0095 47.2469 64.6157 81.5069 102.9672 116.9264 123.2552 140.0800 157.6791 172.3447 223.8889 251.5263 255.7099 256.3313 279.3656 293.7760 300.3608 305.1675 317.2578 321.9695 332.6739 336.6598 367.2535 395.7288 407.0376 442.2188 449.0595 471.7830 491.7556 510.7818 520.7142 530.3854 542.8423 555.9401 570.6198 590.1841 594.2562 602.4333 608.9734 637.7116 661.6046 667.6159 690.8097 706.4327 721.5669 736.5630 747.4775 761.5451 764.2660 774.5016 794.1662 803.1638 821.8292 845.9746 865.9305 878.6278 889.7081 900.9703 908.9481 924.2840 938.1065 953.4838 966.1863 975.1789 985.2719 996.8709 1010.9493 1032.8032 1047.0491 1080.6195 1092.2968 1101.9041 1117.0953 1138.2826 1145.8754 1162.0463 1168.5286 1176.3073 1192.6943 1200.8353 1207.9251 1231.1969 1233.7547 1257.5331 1264.9455 1270.3213 1277.9394 1287.5236 1293.8584 1315.6711 1322.3430 1334.2384 1356.7847 1371.8175 1389.8019 1409.8825 1434.4882 1443.7643 1475.9816 1487.9723 1510.7247 1551.3016 1567.8984 1573.3376 1588.9420 1621.7081 1642.9625 1652.6737 3029.1240 3065.2589 3086.9819 3094.5073 3098.3518 3105.7075 3128.7918 3153.5138 3160.2153 3179.8792 3192.9452 3210.3158 3513.7218 3557.0397 3564.9179 3577.6097
redmass: 7.0385 7.1906 8.7828 6.9850 5.7289 4.4360 6.3834 6.8838 5.6480 6.2214 8.6801 5.7074 5.8479 5.4884 5.1486 4.3540 4.3121 5.4944 2.2119 6.9025 4.5255 4.7978 2.5657 7.1350 1.2144 5.2065 1.1647 4.9450 6.1304 2.9819 4.2860 3.3217 6.2384 5.8748 5.5062 3.3461 5.3667 3.3019 2.3360 3.2255 5.1271 4.0208 4.7540 3.5586 3.5348 6.7309 5.7020 2.1570 4.8832 2.8351 5.1153 2.5494 4.1617 5.5372 2.0335 3.1157 3.5710 4.1175 4.1732 1.3693 2.3510 2.2078 1.7190 2.7002 1.4167 2.7858 1.9559 2.6731 1.9189 3.0217 2.8422 2.0968 1.2357 1.2405 2.3575 1.4503 1.5978 1.9066 1.4385 1.5770 1.9570 1.9829 1.7525 1.6945 1.3688 1.6068 1.3815 3.1136 1.7870 2.3346 1.6094 2.0101 1.4838 1.7502 3.2298 1.6846 3.7479 1.8353 6.3993 3.5553 1.1620 4.2402 3.9091 7.1878 8.5937 5.6012 8.5472 6.3323 7.9841 8.4245 1.0591 1.0819 1.0887 1.0883 1.0892 1.1063 1.0900 1.0905 1.0881 1.0928 1.1093 1.0924 1.0640 1.0649 1.0647 1.0662
irintensity: 0.2884 0.9375 0.7202 0.3041 0.9692 0.1909 0.9555 2.2981 0.2083 2.1497 1.0876 1.3676 0.1223 0.8549 0.3689 3.6449 6.9876 16.5319 6.9661 6.3235 4.3893 10.8750 5.1666 2.4557 62.3109 3.9810 309.6657 11.7613 13.4171 7.9604 2.2652 0.3815 0.5635 3.8871 8.7241 36.8915 2.4315 12.2960 66.8996 37.6965 6.4499 35.6464 10.5152 36.2992 45.5035 1.4812 5.5624 30.1751 4.7568 15.2182 6.7588 15.3768 20.0558 7.8519 26.6116 18.7375 32.4972 19.6391 5.7073 1.5743 11.9327 37.6024 16.6243 1.4305 7.6479 31.3132 16.8239 54.4825 22.7877 91.3018 5.7845 140.8651 1.5232 22.7395 382.1505 16.4451 61.8789 329.0322 20.2103 119.2543 53.5648 16.6328 11.0535 49.2763 2.9265 2.8776 2.5644 101.8016 21.7754 12.2818 10.2966 84.8211 2.7246 29.8019 43.9484 38.6287 21.6442 8.0629 11.6472 52.3066 3.5505 268.7864 134.4938 11.7840 100.2925 0.3724 181.2321 241.3229 0.2188 267.7500 27.0202 1.1414 32.8906 10.3758 6.9779 17.0301 16.1033 3.9401 2.4896 7.7901 6.7735 5.5106 30.2114 6.9359 48.3197 116.1195
temp: 298.150 k
press: 1.00000 atm
elementType: 8 8 8 8 8 8 8 6 6 6 6 6 6 6 6 6 6 6 6 6 6 6 6 6 6 6 6 6 1 1 1 1 1 1 1 1 1 1 1 1 1 1 1 1
symmnumber: 1
zpe: 851193.8 jmol-1
zpe.correction: 0.324203 hartree
zpe.thermalcorrener: 0.347745 hartree
zpe.thermalcorrenthalpy: 0.348689 hartree
zpe.thermalcorrgfe: 0.270989 hartree
zpe.sumelectzpe: -1334.355286 hartree
zpe.sumelectthermal: -1334.331744 hartree
zpe.sumelectthermalent: -1334.330799 hartree
zpe.sumelectthermalfe: -1334.408499 hartree
dipole: 3.5526 -10.2463 -2.4901
dipole: 11.1269
quadrupole: -163.9324 -176.0269 -165.2878
quadrupole: 10.6726 -5.8293 -5.2160
quadrupole: 4.4833 -7.6112 3.1279 10.6726 -5.8293 -5.2160
hfenergy: -1334.6794883 hartree
pointgroup: C01 [X(C21H16O7)]
dipole: -0.5565276 4.2702577 -0.7868306 debye
polarizability: 312.7569166|42.9414429|405.0863863|10.2706641|-0.4341171|152.9755423 unknown
InChI: InChI=1S/C21H16O7/c22-12-5-3-10-16(14-8-1-2-9(7-8)15(14)21(26)27)11-4-6-13(23)18(25)20(11)28-19(10)17(12)24/h1-6,8-9,14-15,22,24-26H,7H2
charge 0 multiplicity 1
44 atoms
O  -2.386904 2.741937 1.968533
O  -3.598078 0.992613 2.887387
O  2.353521 -1.173144 0.25229
O  4.774203 0.074944 0.374289
O  2.480926 -3.909041 0.313449
O  4.98616 2.784585 0.126156
O  0.149006 -5.417481 -0.030817
C  -1.952516 1.517928 -1.619346
C  -1.403909 1.117551 -0.161382
C  -3.8690 1.131121 -0.454553
C  -2.722442 0.727777 0.605014
C  -3.200932 2.343217 -1.172621
C  -2.631801 0.304891 -2.253976
C  -3.788262 0.077586 -1.56169
C  -0.163062 0.234126 -0.110125
C  -2.94513 1.447714 1.923003
C  1.123944 0.952925 -0.059038
C  -0.129403 -1.176797 -0.105868
C  2.336891 0.224469 0.114513
C  1.130603 -1.889401 0.070649
C  1.269792 2.366741 -0.193921
C  -1.285504 -2.04651 -0.289362
C  3.613598 0.821779 0.18455
C  1.258821 -3.267372 0.114557
C  2.528173 2.987904 -0.142058
C  -1.186999 -3.418615 -0.275844
C  3.71005 2.229787 0.054308
C  0.080405 -4.141312 -0.057261
H  -1.1921 2.025105 -2.231611
H  -1.103613 2.076363 0.286386
H  -4.855215 1.279179 0.008804
H  -2.802659 -0.339167 0.855321
H  -2.960828 3.183807 -0.49939
H  -3.79976 2.695227 -2.02816
H  -2.205852 -0.304271 -3.05509
H  -4.491076 -0.750804 -1.684767
H  0.395202 3.000309 -0.352769
H  -2.248826 -1.590356 -0.509953
H  -2.604304 3.152061 2.849299
H  2.600441 4.076731 -0.252492
H  -2.068689 -4.04912 -0.433725
H  4.537338 -0.884858 0.448887
H  3.199924 -3.235552 0.421035
H  4.948765 3.768522 0.024488
