program: Gaussian 09
title: 000274125
version: EM64L-G09RevD.01
frameworkgroup: C1[X(C22H18O7)]
method: RPBEPBE
basis: SDD
operation: Freq
keyword: #pfreq=noraman
keyword: PBEPBE/SDD
title: #p freq=noraman PBEPBE/SDD
converged: NO YES NO NO
title: Mulliken charges:
elementType: O O O O O O O C C C C C C C C C C C C C C C C C C C C C C H H H H H H H H H H H H H H H H H H
charge: -0.417852 -0.223002 -0.380792 -0.387816 -0.378543 -0.383912 -0.213925 -0.281102 -0.284835 -0.106443 -0.280125 -0.266140 -0.215903 -0.253178 0.379352 -0.766011 0.110784 0.278009 0.232808 0.093317 0.099253 -0.376739 -0.291952 -0.015508 -0.061133 -0.421377 -0.392937 0.166552 0.015083 0.268951 0.292921 0.261430 0.261655 0.291708 0.250908 0.260295 0.234589 0.220069 0.236329 0.384722 0.234448 0.250851 0.226804 0.252432 0.372462 0.358524 0.364969
chargesum: 0.00000
title: Mulliken charges with hydrogens summed into heavy atoms:
elementType: O O O O O O O C C C C C C C C C C C C C C C C C C C C C C
charge: -0.033129 -0.223002 -0.380792 -0.015354 -0.020019 -0.018943 -0.213925 -0.012150 0.008086 0.154987 -0.018470 0.025568 0.035005 0.007117 0.379352 -0.075025 0.110784 0.278009 0.232808 0.093317 0.099253 -0.142291 -0.041101 -0.015508 -0.061133 -0.194574 -0.140505 0.166552 0.015083
polarizability: 3.15920890e+02 -2.14522325e+00 4.29133218e+02 -1.00915294e+01 4.84465780e+00 1.57006213e+02
1716.lowfreq: -4.5354 -0.0006 -0.0006 0.0007 6.2096 7.2923 29.6556 31.4827 33.4531
frequency: 29.6084 31.3302 33.3809 48.9130 67.8347 70.0763 98.2108 115.7249 124.1173 133.6942 158.6572 163.6371 173.9541 200.2049 227.6210 255.0214 257.9008 279.1572 283.5300 293.3200 299.9180 305.3544 308.3017 320.3470 334.3762 337.2380 338.8959 365.2414 414.7603 437.2107 444.0304 451.1892 472.2921 502.3511 517.7877 524.5209 532.3521 536.7083 544.2038 567.8897 588.8055 601.1961 607.2765 610.8275 637.9298 657.0589 669.1125 678.3718 701.5411 715.6932 722.1139 740.1109 749.1610 766.4650 767.9843 794.7513 803.0501 823.8528 835.5156 869.6402 875.6168 898.5257 903.4739 920.7346 931.8658 941.5931 962.7289 964.6018 972.2372 978.3629 998.1998 1018.4871 1034.8774 1057.3548 1076.4275 1083.2903 1088.0133 1110.4835 1117.5134 1120.5559 1142.2657 1162.8826 1163.8216 1173.6948 1184.7950 1198.5588 1208.9755 1228.7105 1232.3613 1247.4796 1263.3454 1270.2571 1274.8547 1285.6228 1286.5729 1299.3354 1314.3329 1316.2778 1351.0742 1356.0421 1369.8148 1389.6607 1397.2329 1416.7550 1434.6016 1446.3096 1478.2028 1482.9104 1489.0297 1511.5684 1550.7225 1567.2967 1572.9716 1589.0252 1621.4310 1642.2473 1649.2983 2980.0255 3020.6393 3037.4269 3063.0375 3068.3751 3076.3560 3078.0498 3103.7323 3128.6002 3151.7017 3157.7156 3179.9564 3190.8214 3203.1468 3505.9676 3556.0762 3564.1880 3578.4014
redmass: 7.1955 7.7354 7.4713 7.2877 4.9096 3.9778 5.6527 6.4851 5.6853 6.5102 8.5368 5.2756 1.2860 2.9778 5.6023 4.8269 5.1162 4.4079 3.1193 5.8030 5.2242 3.1022 3.7960 4.4480 3.3425 6.1913 2.1836 1.2311 1.1376 4.5425 5.4826 6.4279 4.1464 4.3763 5.5916 4.9676 3.6623 5.6932 5.1809 6.5801 3.8881 4.8155 4.0386 3.8066 4.0589 2.0719 3.2621 3.3011 3.6032 3.0712 5.8153 3.1305 4.6422 2.7864 2.6342 3.2272 6.9900 1.9734 2.5475 3.3595 3.5308 2.5780 1.7404 2.8300 1.4223 2.8793 1.6130 2.6436 1.9421 2.3121 2.9172 2.1423 3.2290 1.8022 1.6790 1.5232 1.5207 2.1362 2.1168 2.0174 1.6258 1.7542 1.4541 1.6552 1.7605 2.3323 2.0878 1.3784 1.6937 1.4582 1.5720 3.0462 1.5539 2.2308 1.6432 1.6684 1.8205 1.9754 1.6481 2.7080 1.7519 3.0433 1.4278 1.7767 6.1854 3.1190 1.1113 1.2952 2.4560 3.7002 6.9205 8.3471 5.7367 8.5518 6.3855 7.9469 9.2069 1.0368 1.0857 1.0817 1.0838 1.0969 1.0892 1.0970 1.0907 1.0899 1.0902 1.0882 1.0927 1.1088 1.0926 1.0639 1.0649 1.0647 1.0662
irintensity: 0.6952 0.8864 1.7871 0.4849 1.0227 0.1995 0.9460 1.9028 0.0473 1.7494 1.0857 1.4290 0.1185 1.3350 0.2262 0.5035 1.6807 6.2106 1.4140 17.2461 9.7307 3.8292 5.8780 4.1507 2.8465 8.2520 11.5971 67.6486 295.8032 3.8831 14.6280 9.3389 6.3015 3.6861 5.5472 2.5500 1.8504 2.8161 17.9000 9.0269 5.5327 24.8085 3.5839 26.9479 29.8537 68.0485 34.8047 31.2391 13.6990 11.3059 3.6459 23.4754 3.5735 8.5215 26.9607 25.9436 2.6613 42.2670 31.9571 7.0525 11.3332 14.0440 3.9785 8.9976 4.3644 35.5009 9.4326 25.4527 24.9749 17.3395 35.5334 11.3311 80.2021 76.8967 13.6920 45.4280 4.9488 3.7155 314.9213 102.4382 52.0043 208.9472 164.1212 73.0914 56.1827 52.2649 17.5212 5.6745 53.4633 1.7191 13.9348 109.3190 3.1703 15.6313 13.2492 21.0700 4.6242 90.1805 14.4986 53.4467 29.6957 10.5330 20.5282 1.7988 12.6793 50.0605 40.4511 75.5223 178.4629 136.9125 12.4363 98.5349 1.8930 184.5325 241.6159 0.5402 265.6587 21.2409 15.0248 10.2398 9.1774 15.4110 29.0485 46.4129 11.8452 15.9080 3.7750 3.2567 8.5416 9.1324 6.4742 24.3682 8.7496 46.5162 114.3889
temp: 298.150 k
press: 1.00000 atm
elementType: 8 8 8 8 8 8 8 6 6 6 6 6 6 6 6 6 6 6 6 6 6 6 6 6 6 6 6 6 6 1 1 1 1 1 1 1 1 1 1 1 1 1 1 1 1 1 1
symmnumber: 1
zpe: 922385.5 jmol-1
zpe.correction: 0.351318 hartree
zpe.thermalcorrener: 0.376416 hartree
zpe.thermalcorrenthalpy: 0.377360 hartree
zpe.thermalcorrgfe: 0.296819 hartree
zpe.sumelectzpe: -1373.578410 hartree
zpe.sumelectthermal: -1373.553313 hartree
zpe.sumelectthermalent: -1373.552369 hartree
zpe.sumelectthermalfe: -1373.632910 hartree
dipole: 4.4771 -9.2388 -1.5747
dipole: 10.3865
quadrupole: -184.8407 -180.8285 -165.2349
quadrupole: 15.6474 -5.8747 -2.7470
quadrupole: -7.8726 -3.8605 11.7331 15.6474 -5.8747 -2.7470
hfenergy: -1373.9297286 hartree
pointgroup: C01 [X(C22H18O7)]
dipole: -1.1140955 3.8865048 -0.5934729 debye
polarizability: 318.1775042|16.7909364|426.7181075|11.3628273|-3.4633847|157.1647101 unknown
InChI: InChI=1S/C22H18O7/c1-8-9-2-3-10(8)17(22(27)28)16(9)15-11-4-6-13(23)18(25)20(11)29-21-12(15)5-7-14(24)19(21)26/h2-10,16-17,23,25-27H,1H3
charge 0 multiplicity 1
47 atoms
O  -2.010705 1.312389 2.584586
O  -4.242846 0.700188 2.454731
O  2.623767 -0.790492 0.252315
O  4.77634 0.882899 0.289323
O  3.253445 -3.449595 0.406188
O  4.478088 3.581207 0.006079
O  1.240259 -5.374323 0.117924
C  -2.086978 1.087733 -1.588193
C  -3.905093 0.280257 -0.481889
C  -3.511018 1.627146 -1.188481
C  -1.495055 0.760648 -0.134673
C  -2.736489 0.115322 0.586296
C  -2.480118 -0.226068 -2.262129
C  -3.579245 -0.705535 -1.605141
C  -0.112581 0.119518 -0.100254
C  -3.607283 2.935424 -0.387662
C  -3.109318 0.732456 1.928195
C  1.018692 1.064587 -0.072888
C  0.182484 -1.260442 -0.083009
C  2.3477 0.576699 0.089232
C  1.553124 -1.723673 0.10265
C  0.897798 2.478946 -0.224571
C  -0.788748 -2.335045 -0.25475
C  3.493778 1.399912 0.119782
C  1.933901 -3.052468 0.189721
C  2.019714 3.323017 -0.204476
C  -0.43675 -3.664429 -0.205211
C  3.325438 2.799161 -0.028366
C  0.939078 -4.133687 0.045021
H  -1.436915 1.758212 -2.171429
H  -4.905214 0.212255 -0.03135
H  -4.118635 1.7331 -2.10657
H  -1.359105 1.736569 0.354194
H  -2.585471 -0.952803 0.820078
H  -1.923744 -0.708853 -3.069169
H  -4.098015 -1.652817 -1.775411
H  -3.032386 2.934156 0.555296
H  -3.245163 3.783995 -0.99831
H  -4.660563 3.141497 -0.124054
H  -2.300235 1.632335 3.48256
H  -0.081832 2.937017 -0.372727
H  -1.814745 -2.073434 -0.508779
H  1.886836 4.404731 -0.327256
H  -1.183356 -4.45136 -0.357542
H  4.724794 -0.105273 0.352396
H  3.829006 -2.650929 0.520968
H  4.257564 4.539251 -0.109745
