program: Gaussian 09
title: 000273996
version: EM64L-G09RevD.01
frameworkgroup: C1[X(C13H10N2O3)]
method: RPBEPBE
basis: SDD
operation: Freq
keyword: #p
keyword: freq=noraman
keyword: PBEPBE/SDD
title: #p freq=noraman PBEPBE/SDD
converged: YES YES NO NO
title: Mulliken charges:
elementType: O O O N N C C C C C C C C C C C C C H H H H H H H H H H
charge: -0.234145 -0.454028 -0.254379 -0.093012 -0.053040 0.284537 0.120940 -0.345790 -0.329790 -0.225277 -0.224743 -0.370269 0.131821 0.327484 -0.343371 -0.248762 -0.345534 -0.151775 0.283659 0.277960 0.236217 0.239025 0.322258 0.280991 0.258968 0.256528 0.265183 0.388344
chargesum: 0.00000
title: Mulliken charges with hydrogens summed into heavy atoms:
elementType: O O O N N C C C C C C C C C C C C C
charge: -0.234145 -0.065684 -0.254379 -0.093012 -0.053040 0.284537 0.120940 -0.062131 -0.051829 0.010940 0.014283 -0.048011 0.131821 0.327484 -0.062380 0.010205 -0.089006 0.113407
polarizability: 4.46938925e+02 -1.68299560e+01 1.79531809e+02 1.13664435e-01 2.78929980e-01 6.36817619e+01
1716.lowfreq: -7.0180 -0.0010 -0.0009 -0.0009 1.9442 3.9026 19.5648 27.0257 43.2460
frequency: 19.5313 26.8527 43.2435 46.0718 100.8849 125.9136 127.3286 156.0565 181.7032 205.9744 269.7848 298.0577 300.3546 371.7457 374.9804 426.3818 441.5201 495.2299 525.7643 553.6098 585.5493 601.0514 602.5278 639.3041 650.4493 693.1576 740.8569 745.7916 766.4882 780.1283 795.0490 830.9988 861.7881 870.3710 895.8458 912.6689 915.6940 966.4903 974.5390 996.2859 1003.9784 1007.7469 1014.2368 1016.0256 1056.5254 1057.7686 1084.4278 1135.4430 1161.6827 1169.9394 1176.9960 1223.8351 1238.2548 1274.9517 1293.4288 1319.9047 1345.4465 1371.3701 1389.1581 1431.4227 1461.3239 1470.5534 1492.5732 1546.7532 1566.4483 1599.6955 1607.0891 1624.9169 3059.0436 3135.6743 3139.3493 3152.0151 3165.2765 3174.1266 3225.2021 3244.9829 3268.3419 3512.3022
redmass: 9.8748 4.8647 6.2095 6.3256 4.2426 5.3852 3.9443 5.1757 7.9086 3.8697 7.3498 6.1096 3.4625 7.7330 5.6680 3.2997 9.9850 7.0344 3.2256 6.0602 3.0599 1.3148 4.8459 6.1110 4.2709 3.2016 1.2716 5.6013 2.6822 4.9589 1.6671 1.3144 4.5961 6.3194 1.3767 3.7769 1.3747 1.4795 4.9575 1.4000 1.4402 5.4346 1.5814 1.3735 2.7822 2.2343 2.4484 1.5968 1.6341 2.7167 1.0747 1.8465 1.5147 1.7551 1.8558 2.1320 2.2795 2.6835 5.9591 2.4814 4.3124 3.1215 4.2903 5.8830 6.5142 6.6947 7.2012 7.6480 1.0884 1.0864 1.0901 1.0904 1.0943 1.0999 1.0915 1.0994 1.1082 1.0638
irintensity: 0.8302 0.0111 1.2275 4.2783 0.6660 0.2666 0.0555 5.0791 0.4028 0.0107 0.6701 1.5721 22.5582 8.4756 7.8177 11.1507 3.8229 9.6529 2.7044 0.1421 8.5130 84.0139 30.3104 4.9755 5.5680 100.1931 83.1909 3.2383 30.0706 28.9014 32.1606 23.2624 1.7242 7.4326 0.2037 9.6529 0.3619 29.6047 11.0396 1.0835 20.0462 131.8934 30.0447 3.2432 46.4318 32.8942 23.2745 12.1879 83.7100 7.2426 0.7128 17.4403 3.4898 4.5071 64.4256 71.3877 5.2590 4.0054 71.5190 4.5130 60.6612 49.6528 57.3885 10.3347 4.0297 293.0583 59.9834 253.6284 10.4337 3.3943 21.8457 8.1606 1.9743 27.7594 6.8733 0.5068 0.0189 39.0719
temp: 298.150 k
press: 1.00000 atm
elementType: 8 8 8 7 7 6 6 6 6 6 6 6 6 6 6 6 6 6 1 1 1 1 1 1 1 1 1 1
symmnumber: 1
zpe: 533141.1 jmol-1
zpe.correction: 0.203063 hartree
zpe.thermalcorrener: 0.218625 hartree
zpe.thermalcorrenthalpy: 0.219569 hartree
zpe.thermalcorrgfe: 0.156998 hartree
zpe.sumelectzpe: -835.238591 hartree
zpe.sumelectthermal: -835.223029 hartree
zpe.sumelectthermalent: -835.222085 hartree
zpe.sumelectthermalfe: -835.284656 hartree
dipole: -2.5159 -0.3836 0.0051
dipole: 2.5450
quadrupole: -83.2598 -90.2837 -107.9385
quadrupole: -14.4250 -0.0554 0.0177
quadrupole: 10.5675 3.5437 -14.1112 -14.4250 -0.0554 0.0177
hfenergy: -835.4416541 hartree
pointgroup: C01 [X(C13H10N2O3)]
dipole: 0.9841173 -0.1839899 -0.0141915 debye
polarizability: 447.7692233|7.7590454|178.469793|-0.8891309|5.1211549|63.9134801 unknown
InChI: InChI=1S/C13H10N2O3/c16-13(17)12-6-2-1-4-10(12)8-14-15-9-11-5-3-7-18-11/h1-9,16H
charge 0 multiplicity 1
28 atoms
O  4.97878 -1.184727 -0.011664
O  -2.147837 2.604974 0.188094
O  -4.450483 2.563769 0.183025
N  0.326122 -0.631388 0.012493
N  1.557256 0.093552 0.036958
C  -2.081166 -0.369989 0.031498
C  -3.278519 0.426856 0.076938
C  -2.224415 -1.789529 -0.037186
C  -4.547945 -0.218499 0.051732
C  -3.484979 -2.407714 -0.060598
C  -4.660193 -1.617331 -0.01601
C  -0.715124 0.185211 0.049527
C  -3.371892 1.918422 0.151498
C  3.93897 -0.216656 0.021306
C  4.508684 1.059473 0.062743
C  5.937171 0.891323 0.055114
C  2.59438 -0.730952 0.005952
C  6.184372 -0.476243 0.009794
H  -1.305926 -2.382813 -0.071722
H  -5.439225 0.415513 0.08705
H  -3.557083 -3.49963 -0.113234
H  -5.648578 -2.088082 -0.033954
H  -0.576913 1.270946 0.094306
H  3.946704 1.989917 0.093836
H  6.689097 1.677392 0.07959
H  2.465104 -1.825595 -0.033199
H  7.087191 -1.080433 -0.011308
H  -2.343354 3.580132 0.237421
