program: Gaussian 09
title: 000274104
version: EM64L-G09RevD.01
frameworkgroup: C1[X(C20H10Br4O5)]
method: RPBEPBE
basis: SDD
operation: Freq
keyword: #p
keyword: freq=noraman
keyword: PBEPBE/SDD
title: #p freq=noraman PBEPBE/SDD
converged: YES YES NO NO
title: Mulliken charges:
elementType: Br Br Br Br O O O O O C C C C C C C C C C C C C C C C C C C C H H H H H H H H H H
charge: 0.080740 0.110225 0.134103 0.138384 -0.282756 -0.427870 -0.430132 -0.369939 -0.183025 -0.499709 0.318600 0.403059 0.640611 0.156019 0.165887 0.363001 -0.328655 -0.339078 -0.483214 -0.567339 -0.553924 -0.388702 -0.401238 -0.323175 0.304937 0.313351 -0.156657 -0.235939 -0.046964 0.285104 0.238580 0.237624 0.257278 0.253553 0.256214 0.254637 0.358379 0.357283 0.390744
chargesum: 0.00000
title: Mulliken charges with hydrogens summed into heavy atoms:
elementType: Br Br Br Br O O O O O C C C C C C C C C C C C C C C C C C C C
charge: 0.080740 0.110225 0.134103 0.138384 -0.282756 -0.069492 -0.072850 0.020805 -0.183025 -0.214606 0.318600 0.403059 0.640611 0.156019 0.165887 0.363001 -0.090075 -0.101453 -0.483214 -0.310061 -0.300371 -0.132488 -0.146601 -0.323175 0.304937 0.313351 -0.156657 -0.235939 -0.046964
polarizability: 3.82383392e+02 2.75960610e+01 2.96552479e+02 1.27566304e+01 -1.68887659e+01 2.70642412e+02
1716.lowfreq: -1.0348 -0.0004 -0.0002 0.0002 2.9816 5.1866 20.5851 22.4874 35.2827
frequency: 20.5787 22.4805 35.2764 41.5384 43.7533 47.8877 64.9593 88.0325 105.5912 107.9026 120.3558 139.7556 147.6445 149.5720 155.0558 156.8317 194.8261 197.0896 204.6759 214.0119 234.8090 257.6931 264.1657 290.8151 296.1451 316.4010 328.4391 352.5178 355.7016 368.1512 398.9306 405.7051 443.3811 448.4345 456.0090 463.1338 496.9928 507.3028 518.6544 567.1727 581.5868 589.6816 600.6113 604.0414 616.9328 627.9651 637.3784 655.7623 659.1795 700.8090 712.2349 728.3529 743.1838 751.1285 762.7654 796.0210 806.1557 813.9650 831.4093 836.0800 848.9242 866.1596 884.0567 927.7959 947.4468 958.2797 978.1515 1008.1671 1087.2607 1097.4547 1106.9030 1131.8832 1134.3144 1156.2382 1160.3236 1175.6809 1194.5439 1206.3803 1235.0979 1246.6522 1256.9566 1285.3606 1291.4483 1296.6844 1307.1306 1313.1722 1327.9065 1353.0168 1396.5027 1400.6643 1426.1268 1442.2170 1496.4305 1497.8420 1507.6376 1518.9924 1587.7020 1609.5684 1626.2266 1643.0664 1646.7008 2995.9703 3131.0438 3139.2843 3143.0505 3143.8643 3180.3943 3181.2907 3506.4713 3582.9387 3584.7666
redmass: 14.7369 13.7379 6.5401 35.4861 15.3787 7.9737 8.8194 8.4440 9.0794 6.2237 9.7344 30.0391 11.7572 21.9914 17.1031 10.1591 6.3561 9.3519 25.2794 41.1859 10.9096 15.0189 7.2339 6.3370 5.8848 7.6148 6.5656 2.6056 1.5969 1.1353 5.6852 4.6334 5.1828 3.0009 3.6216 4.5587 7.9007 7.6226 6.7566 1.8282 5.4529 9.2763 4.5012 4.4847 6.6849 6.5645 7.5572 4.0407 6.6268 3.1241 4.7102 8.1501 8.2894 6.6401 10.1997 3.0982 2.6991 1.4161 1.7012 1.7481 3.1188 4.8029 6.5965 5.1991 1.3730 1.3663 3.1952 5.8394 2.6858 2.0018 2.9968 1.5896 1.6257 4.8472 1.2870 1.5780 2.4803 2.2232 1.3294 2.1535 2.4329 3.6857 2.8943 5.7442 2.0552 1.6793 2.4524 5.5001 6.0641 6.5580 3.6635 4.3524 3.3776 7.3353 3.2903 9.6774 6.6430 7.4825 7.1541 9.8786 7.7065 1.0804 1.0903 1.0894 1.0920 1.0922 1.0953 1.0951 1.0639 1.0661 1.0661
irintensity: 0.0436 0.0128 0.1872 0.0297 0.0876 0.0130 0.2522 1.9201 0.1004 0.6648 0.4626 0.3118 0.1964 0.0874 0.8220 0.6393 0.0607 0.3282 0.7377 0.2893 1.0284 0.8105 0.5763 2.7525 9.4230 0.1651 0.5964 29.6818 92.1114 144.3088 3.4524 13.3584 3.6727 1.8140 29.3324 29.3289 34.8953 55.6471 4.5217 81.6161 8.6520 0.4083 51.4186 17.7772 6.7464 17.9043 1.2596 4.7935 3.3177 0.7902 13.4698 5.0666 5.2310 1.2154 2.0693 20.8994 13.3173 0.7546 46.9223 49.0376 33.2284 6.3302 2.1112 3.7987 0.1655 0.6487 51.8560 112.7385 11.5574 101.4010 107.7259 374.4072 443.7404 128.4515 9.9987 100.1091 3.1073 3.0414 4.4794 38.6218 83.6026 42.8777 40.8882 65.3985 15.1039 49.4884 20.2081 21.6120 7.7343 21.1056 22.2006 37.2832 312.4704 34.9541 11.7152 14.4876 133.3981 12.0196 177.9299 232.6666 55.1457 5.0359 8.4411 8.6575 3.0163 3.9615 4.3526 3.0058 32.4633 57.4289 54.8966
temp: 298.150 k
press: 1.00000 atm
elementType: 35 35 35 35 8 8 8 8 8 6 6 6 6 6 6 6 6 6 6 6 6 6 6 6 6 6 6 6 6 1 1 1 1 1 1 1 1 1 1
symmnumber: 1
zpe: 647513.2 jmol-1
zpe.correction: 0.246625 hartree
zpe.thermalcorrener: 0.273556 hartree
zpe.thermalcorrenthalpy: 0.274501 hartree
zpe.thermalcorrgfe: 0.186030 hartree
zpe.sumelectzpe: -1196.047414 hartree
zpe.sumelectthermal: -1196.020483 hartree
zpe.sumelectthermalent: -1196.019539 hartree
zpe.sumelectthermalfe: -1196.108009 hartree
dipole: 2.9755 1.1730 -0.5057
dipole: 3.2381
quadrupole: -171.3108 -197.7539 -207.9183
quadrupole: 10.8285 4.9619 3.8732
quadrupole: 21.0169 -5.4262 -15.5907 10.8285 4.9619 3.8732
hfenergy: -1196.2940392 hartree
pointgroup: C01 [X(C20H10Br4O5)]
dipole: 1.1339609 -0.5224654 -0.2533723 debye
polarizability: 381.2643131|-12.6457704|296.8015739|-27.6852913|20.0167677|271.5123962 unknown
InChI: InChI=1S/C20H10Br4O5/c21-16-14(15(20(27)28)17(22)19(24)18(16)23)13-9-3-1-7(25)5-11(9)29-12-6-8(26)2-4-10(12)13/h1-6,13,25-27H
charge 0 multiplicity 1
39 atoms
Br -2.041091 0.435924 3.320253
Br -2.964498 -0.215206 -3.307165
Br -5.137961 0.599443 2.047407
Br -5.625086 0.298051 -1.278075
O  2.984736 0.073692 -0.123796
O  3.233567 -4.761808 -0.288607
O  3.083759 4.915916 0.012086
O  -0.270123 -1.772627 -2.205391
O  0.561477 0.397962 -2.194993
C  0.263358 -0.011866 1.111237
C  1.053384 -1.250696 0.693405
C  1.018294 1.284715 0.792529
C  -1.175891 0.010847 0.54591
C  2.345627 -1.154726 0.12814
C  2.308134 1.26824 0.217067
C  -1.418458 -0.169584 -0.846942
C  0.544008 -2.552726 0.930759
C  0.4639 2.553194 1.09503
C  -2.302302 0.235576 1.382727
C  3.099131 -2.296711 -0.218935
C  3.028054 2.447506 -0.055628
C  1.267523 -3.710451 0.60379
C  1.151762 3.751251 0.835952
C  -2.725058 -0.070544 -1.377098
C  2.552544 -3.574583 0.022646
C  2.44019 3.691676 0.253666
C  -3.623217 0.307454 0.864465
C  -3.838592 0.169182 -0.533074
C  -0.269763 -0.441609 -1.793279
H  0.146477 -0.058904 2.209778
H  -0.454123 -2.655805 1.372575
H  -0.535755 2.604894 1.540528
H  4.094838 -2.15798 -0.654848
H  4.021902 2.366341 -0.509447
H  0.865978 -4.710864 0.782947
H  0.715146 4.725854 1.068038
H  4.129983 -4.572501 -0.662008
H  3.963106 4.776527 -0.418928
H  0.484337 -1.923452 -2.838619
