program: Gaussian 09
title: 000274070
version: EM64L-G09RevD.01
frameworkgroup: C1[X(C20H16N2O)]
method: RPBEPBE
basis: SDD
operation: Freq
keyword: #p
keyword: freq=noraman
keyword: PBEPBE/SDD
title: #p freq=noraman PBEPBE/SDD
converged: YES YES NO NO
title: Mulliken charges:
elementType: O N N C C C C C C C C C C C C C C C C C C C C H H H H H H H H H H H H H H H H
charge: -0.249574 -0.319735 -0.603611 -0.020088 0.339247 0.057184 0.407020 0.028491 0.432176 -0.382085 -0.369466 -0.357811 -0.412179 -0.221216 -0.223971 -0.363266 -0.338862 -0.234379 -0.226030 -0.242330 -0.230191 -0.271032 -0.251931 0.292580 0.297075 0.260790 0.270548 0.257790 0.280906 0.230243 0.233650 0.302153 0.261013 0.229029 0.225915 0.230019 0.226666 0.226289 0.228973
chargesum: 0.00000
title: Mulliken charges with hydrogens summed into heavy atoms:
elementType: O N N C C C C C C C C C C C C C C C C C C C C
charge: -0.249574 -0.319735 -0.013956 -0.020088 0.339247 0.057184 0.407020 0.028491 0.432176 -0.121295 -0.098918 -0.100020 -0.131273 0.009028 0.009679 -0.061113 -0.077849 -0.005350 -0.000115 -0.012311 -0.003526 -0.044743 -0.022959
polarizability: 2.93430458e+02 -8.69584245e+00 2.45281123e+02 4.79991808e+00 2.60240823e+01 1.57778700e+02
1716.lowfreq: -2.7885 0.0001 0.0005 0.0007 6.4727 11.1468 37.4854 55.0668 58.0641
frequency: 37.4832 55.0157 58.0594 62.6278 73.0913 116.7255 137.9441 170.6761 205.0378 235.9470 259.5730 273.8488 283.8993 293.6361 316.0211 341.6712 381.3323 401.9149 409.3909 410.5506 431.9957 474.8994 487.4078 524.4709 532.5393 583.6400 598.6091 615.2005 615.9278 623.4779 647.2866 679.4906 687.5452 692.5987 701.4273 709.7007 759.3476 764.0458 777.4767 791.5152 823.8831 832.5407 847.2143 864.8780 878.5159 894.7339 919.3782 942.6948 965.3546 969.4431 976.8287 984.9293 989.7831 992.9263 995.9737 999.4034 1004.9062 1014.1641 1025.9751 1032.0126 1065.3735 1080.9719 1091.2382 1110.0499 1123.8974 1135.6945 1171.6326 1172.1195 1175.2109 1185.9025 1201.4898 1215.7829 1243.0651 1270.8794 1286.5280 1310.4817 1318.3820 1346.8205 1377.3976 1380.5827 1406.8033 1436.0603 1445.0037 1452.1930 1464.0092 1477.2190 1487.5580 1581.7549 1591.3644 1608.9110 1610.1110 1612.3468 1617.4542 1623.2438 1644.6273 3125.7542 3126.3688 3133.3427 3135.3463 3136.7918 3147.5770 3148.3549 3155.7922 3156.5004 3159.7339 3166.8189 3167.4115 3170.1762 3193.7979 3465.4428 3595.4688
redmass: 5.2664 3.9507 5.2449 4.6020 4.5602 4.8973 5.2989 4.2864 4.5084 4.8484 4.4364 5.0421 4.8713 4.2030 2.2001 4.7992 5.0899 2.0728 2.5970 2.9468 3.1175 4.1267 3.4043 6.3348 3.5974 4.7685 5.4362 5.0486 6.1730 2.2201 3.8490 4.3363 4.8139 4.6525 2.2160 1.8925 1.9508 1.6878 1.8220 2.5718 4.4971 6.1840 1.2669 1.2635 2.9104 1.4647 1.4474 1.4233 1.4150 6.4096 1.4485 4.0704 5.0413 1.4425 1.3893 1.3316 1.3153 2.2166 2.3421 2.3304 3.0134 1.6748 2.1080 2.0585 2.0675 1.8149 1.0574 1.1227 1.0523 1.1257 1.1417 2.9404 3.7925 2.3271 1.8507 1.4435 1.9631 1.9399 7.2124 9.0183 8.0776 2.2235 2.4494 2.5193 2.6954 2.2438 2.2930 6.0539 6.2934 6.1027 6.0379 7.2592 7.2639 8.8256 1.1470 1.0848 1.0850 1.0859 1.0881 1.0900 1.0902 1.0923 1.0938 1.0953 1.0953 1.0988 1.1008 1.1002 1.0946 1.0450 1.0983
irintensity: 1.1276 0.0578 1.3992 0.1665 0.2982 0.5207 2.0346 0.9050 0.9624 0.6882 4.3878 4.2898 3.8915 4.1511 6.4648 13.7348 4.0971 13.6246 2.2701 1.0074 7.6448 5.4198 15.7006 17.1987 14.5315 12.1689 7.0554 18.6244 4.4894 109.6074 46.8531 25.1954 24.8526 18.8750 36.8761 44.6190 29.3070 83.6418 67.5190 13.5840 10.7226 41.8618 1.4291 1.0243 12.9372 1.8708 12.8572 6.4014 2.4899 46.7300 1.0475 0.9171 0.5356 1.4811 1.3966 0.1699 2.6450 8.6465 9.5910 10.3500 4.3138 3.0443 14.6342 27.9788 25.5290 0.4995 0.4661 5.6818 0.8697 5.9754 6.1372 41.6635 44.5178 23.3060 35.5567 35.0244 145.8929 158.0980 1.2756 0.8083 3.8992 13.8994 9.0298 17.0347 3.6234 15.6240 142.0502 0.6117 0.9230 16.2594 42.3363 20.3550 127.7827 110.7166 48.9647 0.7930 1.3660 1.3564 7.6112 16.5582 11.3639 17.0830 28.2920 16.7787 11.4255 14.3071 24.0038 25.7962 8.9445 5.2026 4.9083
temp: 298.150 k
press: 1.00000 atm
elementType: 8 7 7 6 6 6 6 6 6 6 6 6 6 6 6 6 6 6 6 6 6 6 6 1 1 1 1 1 1 1 1 1 1 1 1 1 1 1 1
symmnumber: 1
zpe: 805597.7 jmol-1
zpe.correction: 0.306836 hartree
zpe.thermalcorrener: 0.324945 hartree
zpe.thermalcorrenthalpy: 0.325889 hartree
zpe.thermalcorrgfe: 0.260742 hartree
zpe.sumelectzpe: -954.904762 hartree
zpe.sumelectthermal: -954.886653 hartree
zpe.sumelectthermalent: -954.885709 hartree
zpe.sumelectthermalfe: -954.950856 hartree
dipole: 1.4097 2.7529 2.3134
dipole: 3.8623
quadrupole: -118.5835 -130.2386 -130.3577
quadrupole: -3.9180 -0.7909 -2.9880
quadrupole: 7.8098 -3.8453 -3.9644 -3.9180 -0.7909 -2.9880
hfenergy: -955.2115977 hartree
pointgroup: C01 [X(C20H16N2O1)]
dipole: 0.3232013 -1.150973 -0.9379835 debye
polarizability: 294.8750977|-2.0132354|242.4176685|1.4475891|28.604242|159.1975142 unknown
InChI: InChI=1S/C20H16N2O/c21-20(15-9-3-1-4-10-15)18-14-8-7-13-17(18)19(23)22(20)16-11-5-2-6-12-16/h1-14H,21H2
charge 0 multiplicity 1
39 atoms
O  0.366915 2.826464 1.347762
N  -0.297263 0.934015 0.019623
N  0.145736 -0.222175 -2.172683
C  0.409426 -0.211981 -0.743668
C  1.880281 0.140196 -0.488766
C  1.984427 1.271927 0.339177
C  0.08963 -1.583991 -0.100778
C  0.628402 1.799213 0.65692
C  -1.711981 1.128433 -0.048338
C  3.026692 -0.519757 -0.960206
C  3.234234 1.783521 0.737748
C  -0.161573 -1.691605 1.289451
C  0.134532 -2.759294 -0.889569
C  4.291331 -0.011539 -0.572434
C  4.395642 1.12576 0.27189
C  -2.296649 2.378885 0.307512
C  -2.567048 0.08227 -0.502402
C  -0.374755 -2.955482 1.878769
C  -0.084574 -4.024638 -0.298733
C  -0.338901 -4.128067 1.087508
C  -3.689686 2.566127 0.198935
C  -3.95802 0.288021 -0.609539
C  -4.533435 1.530733 -0.264388
H  0.5575 0.566535 -2.678407
H  -0.826525 -0.407714 -2.4365
H  2.943352 -1.400922 -1.603876
H  3.285129 2.666355 1.38298
H  -0.203309 -0.787485 1.906169
H  0.343387 -2.666906 -1.960083
H  5.203758 -0.504466 -0.926081
H  5.38609 1.494385 0.560289
H  -1.658388 3.180519 0.681825
H  -2.16641 -0.910454 -0.724724
H  -0.573537 -3.025732 2.953934
H  -0.052904 -4.927273 -0.919526
H  -0.507843 -5.108328 1.547044
H  -4.11623 3.535422 0.481096
H  -4.592712 -0.536116 -0.954389
H  -5.614516 1.685943 -0.345643
