program: Gaussian 09
title: 000274072
version: EM64L-G09RevD.01
frameworkgroup: C1[X(C22H20N2)]
method: RPBEPBE
basis: SDD
operation: Freq
keyword: #pfreq=noraman
keyword: PBEPBE/SDD
title: #p freq=noraman PBEPBE/SDD
converged: YES YES NO NO
title: Mulliken charges:
elementType: N N C C C C C C C C C C C C C C C C C C C C C C H H H H H H H H H H H H H H H H H H H H
charge: -0.088312 -0.147898 -0.657922 0.045007 0.500102 0.328706 -0.441928 -0.386193 -0.332521 -0.361840 -0.223610 -0.222678 0.329098 0.112450 -0.262974 -0.259167 -0.250349 -0.235847 -0.368876 -0.361356 -0.795643 -0.238986 -0.228102 -0.236511 0.257303 0.221797 0.234313 0.241517 0.287230 0.250081 0.225389 0.223571 0.229872 0.226925 0.227904 0.230370 0.232538 0.272659 0.236106 0.241348 0.264293 0.225446 0.227292 0.229395
chargesum: 0.00000
title: Mulliken charges with hydrogens summed into heavy atoms:
elementType: N N C C C C C C C C C C C C C C C C C C C C C C
charge: -0.088312 -0.147898 -0.178822 0.045007 0.500102 0.328706 -0.207614 -0.144676 -0.045292 -0.111759 0.001779 0.000892 0.329098 0.112450 -0.033102 -0.032242 -0.022445 -0.005477 -0.136338 -0.088697 -0.053896 -0.013540 -0.000810 -0.007116
polarizability: 4.17954992e+02 -2.43726641e+01 2.37789332e+02 -1.26095433e+01 1.68858129e+01 1.76211840e+02
1716.lowfreq: -7.6589 -0.0004 0.0003 0.0007 3.9440 4.7340 17.3002 21.0814 29.4288
frequency: 17.1471 20.6225 29.3895 34.4540 37.0484 51.7740 65.5624 94.2896 117.4539 148.6577 154.4831 179.0279 188.4496 245.9877 268.3998 293.6089 334.1833 346.6427 387.1411 402.5573 404.2398 404.4968 419.1583 437.8348 459.1439 477.2128 503.8266 553.4412 564.8380 600.6526 614.5956 615.4019 620.8096 644.0421 677.9757 694.8856 698.5563 704.1811 719.8974 744.4053 761.3405 774.8863 783.0220 813.1985 850.8823 854.0923 854.3336 874.8442 914.7198 929.2926 932.6884 966.3927 977.4657 982.2885 983.8423 987.9484 989.2762 989.9775 995.2646 1001.4113 1002.4820 1014.7605 1021.9369 1026.1632 1029.8440 1040.6822 1074.5651 1079.0619 1081.9609 1087.9818 1122.0357 1171.0734 1172.1294 1174.3720 1186.0563 1188.4539 1192.1383 1200.3011 1202.8795 1278.2319 1291.5287 1313.4936 1320.7436 1326.9250 1336.8573 1378.1697 1380.7983 1381.7758 1383.4770 1431.3726 1433.6372 1440.4352 1455.8421 1460.1839 1468.0162 1481.3662 1483.3145 1487.1466 1537.1526 1545.5693 1579.7279 1585.0826 1592.9172 1607.3053 1612.1705 1612.8152 2974.9264 2991.4242 3047.7390 3057.3781 3094.9103 3110.6454 3122.4559 3124.8708 3125.7211 3134.1199 3134.7425 3137.7422 3144.9111 3148.1195 3154.4126 3157.8414 3162.4530 3167.2996 3168.1405 3173.0423
redmass: 4.1436 4.1728 3.8392 5.0759 4.3427 4.6997 3.6991 4.9265 1.2330 4.1936 4.4893 4.7597 3.6976 4.1633 4.3011 5.2649 2.6703 3.4025 4.3480 2.9264 2.8194 2.8538 4.2776 4.7746 2.9064 4.1800 4.9952 4.1630 3.1283 4.9724 6.3507 6.4054 5.9748 5.4566 4.8240 1.6668 1.7999 2.0860 2.4521 4.5577 2.1139 1.8323 2.6033 3.3818 1.2549 1.2487 1.2495 2.5497 1.5119 1.4137 1.4483 2.1201 1.3962 1.6895 1.4955 4.9192 3.1488 5.8532 1.3412 1.3304 1.3331 2.8395 2.3874 2.2400 1.9052 1.9103 2.0140 2.1941 1.6658 1.6088 2.5532 1.0584 1.0562 1.0592 1.1107 1.1224 1.2667 1.7805 1.4212 3.1113 1.4817 1.6072 2.5166 1.3879 1.3848 6.5936 2.0909 4.7433 2.4742 2.3266 2.3176 2.1435 1.1643 1.1421 1.1334 2.2081 2.0670 2.1424 5.6379 7.0010 5.9499 6.1592 6.0698 5.9254 6.1319 6.0910 1.0376 1.0598 1.1002 1.0957 1.0992 1.0876 1.0856 1.0846 1.0850 1.0881 1.0910 1.0896 1.0958 1.0926 1.0946 1.0956 1.1014 1.0939 1.1007 1.0985
irintensity: 0.0418 0.0527 0.0209 0.1459 0.3031 0.3487 1.0675 0.5834 0.5488 2.5853 0.4294 0.9123 0.9082 2.6875 1.1482 1.5520 0.1672 2.4471 0.5167 0.3579 0.0412 0.0728 2.0218 2.2373 6.2308 0.2063 11.9231 12.7474 13.7554 9.5621 0.5713 0.3130 1.6374 62.1648 16.1616 51.7939 36.3219 58.4840 28.7189 7.8381 26.3119 63.6024 24.5509 7.1388 0.5515 0.1741 0.2211 10.2781 0.5770 4.2555 2.7994 10.0861 0.0472 0.4601 0.2254 0.3722 0.2831 0.6050 0.2449 0.1023 1.4816 18.2309 17.1079 7.3906 8.0746 5.9781 6.3160 8.3881 11.3665 3.8154 8.3032 0.1197 0.7477 0.7812 1.4912 9.5222 14.1172 1.5441 6.1764 27.0991 1.3449 11.6376 48.6244 2.2747 4.7993 3.7358 13.6996 2.5300 18.2890 3.2078 19.1957 7.6758 10.3172 31.8450 10.6422 20.7103 35.8801 10.9487 8.4439 15.4087 5.4590 0.4935 0.1775 5.0564 2.5656 15.3430 12.1710 21.4598 11.3827 9.7568 22.0914 9.4662 1.4394 2.5487 0.2748 5.9845 12.5335 12.1631 42.7284 28.9097 25.5857 27.6477 29.0511 10.9102 25.3675 16.6142
temp: 298.150 k
press: 1.00000 atm
elementType: 7 7 6 6 6 6 6 6 6 6 6 6 6 6 6 6 6 6 6 6 6 6 6 6 1 1 1 1 1 1 1 1 1 1 1 1 1 1 1 1 1 1 1 1
symmnumber: 1
zpe: 931899.8 jmol-1
zpe.correction: 0.354942 hartree
zpe.thermalcorrener: 0.375887 hartree
zpe.thermalcorrenthalpy: 0.376832 hartree
zpe.thermalcorrgfe: 0.301361 hartree
zpe.sumelectzpe: -958.145374 hartree
zpe.sumelectthermal: -958.124428 hartree
zpe.sumelectthermalent: -958.123484 hartree
zpe.sumelectthermalfe: -958.198954 hartree
dipole: -0.3489 0.3090 -1.6828
dipole: 1.7462
quadrupole: -120.2335 -133.7473 -139.5902
quadrupole: -2.0215 -4.7284 5.9723
quadrupole: 10.9568 -2.5570 -8.3999 -2.0215 -4.7284 5.9723
hfenergy: -958.5003157 hartree
pointgroup: C01 [X(C22H20N2)]
dipole: 0.0750092 0.002633 -0.6828897 debye
polarizability: 406.6133021|-49.5272603|252.5362438|-15.4538442|1.1111763|172.8066173 unknown
InChI: InChI=1S/C22H20N2/c1-18(20-13-7-3-8-14-20)23-24-22(21-15-9-4-10-16-21)17-19-11-5-2-6-12-19/h2-16H,17H2,1H3
charge 0 multiplicity 1
44 atoms
N  0.045681 0.368043 1.371597
N  -1.302081 0.299901 1.135051
C  2.327162 -0.299451 1.522643
C  0.937524 -0.505614 0.918546
C  3.38187 0.29399 0.583006
C  0.710169 -1.612702 -0.05211
C  4.7293 -0.143002 0.65504
C  3.051648 1.323571 -0.333891
C  -0.592638 -1.978456 -0.50943
C  1.819681 -2.378532 -0.523495
C  5.724481 0.435221 -0.165381
C  4.042436 1.901135 -1.158421
C  -3.429037 1.27351 0.60122
C  -1.946252 1.347884 0.633998
C  -0.772656 -3.070118 -1.383516
C  1.636229 -3.460034 -1.407673
C  5.38388 1.460311 -1.077532
C  0.337996 -3.814933 -1.842408
C  -4.194583 2.212791 -0.144855
C  -4.120134 0.250303 1.315295
C  -1.2103 2.559895 0.095339
C  -5.604282 2.134645 -0.174578
C  -5.52533 0.177049 1.287406
C  -6.277125 1.119225 0.541706
H  2.187871 0.388441 2.377133
H  2.702211 -1.255195 1.936373
H  5.00188 -0.937253 1.362206
H  2.013764 1.669667 -0.400921
H  -1.460843 -1.414902 -0.159724
H  2.835237 -2.117198 -0.213477
H  6.760901 0.085728 -0.094313
H  3.769692 2.694843 -1.863568
H  -1.783976 -3.335373 -1.711487
H  2.506239 -4.025338 -1.760045
H  6.152531 1.908457 -1.717047
H  0.195597 -4.655237 -2.531146
H  -3.691993 3.000445 -0.716092
H  -3.529815 -0.470913 1.889205
H  -1.770875 3.491025 0.280928
H  -1.037381 2.479369 -0.995717
H  -0.223105 2.627089 0.587016
H  -6.1765 2.864944 -0.757698
H  -6.040014 -0.611499 1.84804
H  -7.371065 1.060771 0.52068
