program: Gaussian 09
title: 000026331
version: EM64L-G09RevD.01
frameworkgroup: C1[X(C6H8N2)]
method: RPBEPBE
basis: SDD
operation: Freq
keyword: #p
keyword: freq=noraman
keyword: PBEPBE/SDD
title: #p freq=noraman PBEPBE/SDD
converged: YES YES NO NO
title: Mulliken charges:
elementType: N N C C C C C C H H H H H H H H
charge: -0.018819 0.011499 -0.466918 0.258681 -0.674228 -0.416782 -0.294089 -0.251840 0.228752 0.208102 0.215467 0.221333 0.244760 0.249069 0.240573 0.244440
chargesum: 0.00000
title: Mulliken charges with hydrogens summed into heavy atoms:
elementType: N N C C C C C C
charge: -0.018819 0.011499 -0.030064 0.258681 0.007332 -0.167713 -0.053516 -0.007400
polarizability: 9.77741890e+01 4.88062640e+00 7.63525715e+01 -5.60599640e+00 1.03829661e+00 4.43517185e+01
1716.lowfreq: -8.0713 -0.0010 -0.0007 -0.0007 6.6326 12.9587 41.1249 127.4970 217.2523
frequency: 41.0005 127.4947 217.2469 264.0733 352.7676 403.5106 497.0268 577.4103 620.7672 765.2303 784.3891 797.4941 847.6885 935.4806 957.6503 970.2491 975.4327 1036.9611 1054.4464 1066.6896 1158.4536 1223.3799 1236.4560 1254.7598 1302.3930 1328.3207 1383.2965 1389.0739 1442.3501 1463.3667 1474.5480 1488.4624 1503.2033 1534.8823 2987.0272 2997.2396 3052.9371 3085.2972 3098.7178 3130.9059 3133.7944 3158.5081
redmass: 2.7651 3.1428 1.1619 2.4702 2.2925 4.4099 4.4753 4.6698 6.1101 2.3452 1.2600 4.3196 1.4582 1.3930 1.4713 3.5593 2.9960 2.6743 1.7230 1.9054 2.0096 2.5518 2.0189 1.8668 1.4531 1.3890 1.2587 1.6964 2.0222 1.0916 1.0426 1.0886 6.8754 4.7252 1.0348 1.0598 1.1014 1.1007 1.1011 1.0886 1.0917 1.0993
irintensity: 0.1122 0.7475 0.3282 0.2453 1.0751 19.5177 0.5594 0.3863 0.0800 7.7470 4.5043 1.4619 31.1678 0.6929 0.1063 8.3688 9.0144 4.6710 2.1212 16.1389 9.0950 5.0463 2.2003 0.5949 4.7009 3.2337 14.7519 22.3241 29.6914 7.4555 15.0044 12.5861 7.9783 16.5352 35.8734 23.0826 7.8741 43.7830 29.7477 5.7512 25.4176 34.7558
temp: 298.150 k
press: 1.00000 atm
elementType: 7 7 6 6 6 6 6 6 1 1 1 1 1 1 1 1
symmnumber: 1
zpe: 341655.8 jmol-1
zpe.correction: 0.130130 hartree
zpe.thermalcorrener: 0.137424 hartree
zpe.thermalcorrenthalpy: 0.138368 hartree
zpe.thermalcorrgfe: 0.097851 hartree
zpe.sumelectzpe: -342.328818 hartree
zpe.sumelectthermal: -342.321524 hartree
zpe.sumelectthermalent: -342.320579 hartree
zpe.sumelectthermalfe: -342.361096 hartree
dipole: 0.8215 -0.2202 -0.0639
dipole: 0.8529
quadrupole: -44.4935 -49.4168 -48.9761
quadrupole: 7.5616 -0.3532 -1.4297
quadrupole: 3.1353 -1.7880 -1.3473 7.5616 -0.3532 -1.4297
hfenergy: -342.4589475 hartree
pointgroup: C01 [X(C6H8N2)]
dipole: -0.3216097 -0.0955595 -0.0055382 debye
dipolederiv: -0.377502 -0.0213773 -0.0005662 0.1212858 -0.2197764 0.0158833 0.0382186 0.0266211 -0.2588039 -0.1696166 -0.0519937 -0.0292356 -0.0660806 -0.1999155 0.0178056 -0.0284104 0.023412 -0.2511557 -0.1891914 -0.0013178 -0.0248199 -0.1344725 0.1577322 0.0249915 -0.1173942 0.0067306 0.0428723 0.7283413 -0.0998512 -0.0691578 0.1690485 -0.1110353 -0.0928596 -0.090569 -0.0302085 0.0518674 0.0136345 0.0003552 -0.0350027 0.0430599 0.0590803 -0.0389256 0.0936434 -0.0374927 0.0247869 -0.2389536 0.0707442 0.0248224 -0.3033093 0.2493924 0.101483 -0.0130383 0.0338073 -0.0048222 -0.032155 0.0508681 0.012536 -0.2940501 0.2974563 0.0921557 -0.0506828 0.0474408 0.013163 0.2666426 -0.1220458 -0.0845965 0.210601 -0.1281503 -0.0485623 -0.0064529 0.0007393 -0.0195017 0.0179586 -0.0129923 0.02846 -0.0249164 0.0057352 0.1231868 0.0420469 0.0797087 -0.0363557 0.0362838 -0.006197 -0.0063874 0.0648851 -0.1112983 -0.1236672 0.006687 -0.078329 0.0312938 0.0881315 -0.0579004 0.0297184 -0.0167791 -0.0369662 0.135836 -0.0144752 0.097186 -0.0547085 -0.2320928 -0.0063998 0.0204441 -0.0118178 0.1112759 -0.0044642 0.0171166 -0.0012628 0.0622144 0.1122208 0.0696924 0.0240202 0.0243655 -0.0672023 -0.0904946 0.0075276 -0.0579306 0.0452666 0.0445847 0.0743664 0.0329228 0.0981352 -0.0407544 -0.0486816 0.0362243 -0.0457051 0.1110796 0.036963 0.0653437 0.0261233 0.1119272 -0.0604684 -0.0531464 0.0361796 -0.0468541 0.1143878 -0.1052494 0.0487055 0.0507188 0.0081174 0.0948947 -0.0105404 0.0433787 -0.017863 0.128416 unknown
polarizability: 98.1253937|-2.945511|74.4649436|-5.8017909|7.2531992|45.8881418 unknown
InChI: InChI=1S/C6H8N2/c1-2-6-5-7-3-4-8-6/h3-5H,2H2,1H3
charge 0 multiplicity 1
16 atoms
N  -0.005904 -1.129689 -0.0405
N  1.653345 1.189211 0.119323
C  -2.021785 0.163419 0.550037
C  -0.531346 0.095877 0.291699
C  -2.847096 -0.116048 -0.733028
C  0.311108 1.238749 0.369042
C  1.33454 -1.183101 -0.288233
C  2.160023 -0.035719 -0.212432
H  -2.279157 -0.595673 1.312771
H  -2.283779 1.154338 0.964592
H  -2.66094 0.653748 -1.503761
H  -3.928051 -0.121709 -0.506044
H  -2.57057 -1.09892 -1.151737
H  -0.096787 2.219485 0.637666
H  1.747418 -2.163721 -0.549041
H  3.234681 -0.087548 -0.415152
