program: Gaussian 09
title: 000274067
version: EM64L-G09RevD.01
frameworkgroup: C1[X(C13H19NO2S)]
method: RPBEPBE
basis: SDD
operation: Freq
keyword: #p
keyword: freq=noraman
keyword: PBEPBE/SDD
title: #p freq=noraman PBEPBE/SDD
converged: YES YES NO NO
title: Mulliken charges:
elementType: S O O N C C C C C C C C C C C C C H H H H H H H H H H H H H H H H H H H
charge: 0.891182 -0.553369 -0.566005 -0.275027 0.027113 -0.502507 -0.520024 -0.427078 -0.446043 0.410560 -0.340302 -0.387887 -0.604472 -0.604647 -0.243501 -0.240349 -0.233621 0.232464 0.280079 0.296798 0.228443 0.206465 0.232169 0.250837 0.224611 0.241336 0.257750 0.279303 0.236093 0.217404 0.265339 0.241322 0.228566 0.230275 0.232454 0.234266
chargesum: 0.00000
title: Mulliken charges with hydrogens summed into heavy atoms:
elementType: S O O N C C C C C C C C C C C C C
charge: 0.891182 -0.553369 -0.566005 -0.275027 0.027113 0.010036 0.005217 0.011555 0.029405 0.410560 -0.098966 -0.130137 0.128330 0.130579 -0.013225 -0.007894 0.000646
polarizability: 2.22725097e+02 -2.81545609e+00 1.81854415e+02 4.89546006e-02 -8.58790765e+00 1.58782550e+02
1716.lowfreq: -11.0983 -6.1929 0.0008 0.0019 0.0023 1.6798 16.6442 57.0601 59.3815
frequency: 14.0926 57.0275 59.3235 61.7437 66.2890 98.8966 146.2532 157.5961 168.9632 179.9292 187.2416 196.2997 218.6364 241.8532 262.1562 284.0374 290.0822 315.4074 356.1584 367.6772 390.7620 401.2726 419.4618 432.8011 497.5846 526.2023 579.5843 613.8810 635.1244 694.4979 712.2464 773.0217 792.8354 818.9723 844.5040 847.6596 863.3432 895.2462 906.8850 912.5373 932.4097 949.3208 969.4086 976.8929 989.8864 998.7666 1011.2269 1027.9052 1034.9691 1059.9104 1073.0083 1077.6833 1104.6131 1145.4791 1147.0053 1151.0349 1159.3565 1175.4705 1198.1372 1200.3292 1224.1972 1240.2400 1267.6300 1289.0499 1302.9917 1317.1278 1328.4189 1340.2227 1379.9243 1407.1971 1419.5990 1436.8603 1441.5848 1443.4194 1443.8087 1459.5223 1465.0651 1472.1880 1481.9314 1482.7089 1484.9437 1579.7966 1605.5572 2938.1841 2952.1398 2969.2485 2974.7133 2996.9111 3013.1868 3039.1096 3039.9682 3045.9168 3053.7555 3073.6230 3086.5086 3090.5063 3107.0804 3129.2476 3139.5852 3153.5225 3163.1516 3172.0705
redmass: 5.4422 3.2117 3.9474 3.0732 3.0994 4.5438 3.5647 3.6080 1.9100 3.1424 1.2071 3.0026 2.4229 3.4551 6.1637 2.7098 2.3888 3.8405 4.0825 5.4448 2.7652 2.7850 3.5775 4.2732 7.3601 2.6021 2.2068 6.0956 4.2491 1.6530 2.2950 1.9303 15.8476 2.0787 1.5553 2.7059 1.9166 11.8045 2.3144 1.5939 1.5263 4.0603 2.0288 1.3956 5.6478 1.3448 1.5115 1.9520 1.5292 1.9018 1.2348 1.8500 1.4082 1.8461 2.5964 3.0935 1.3970 1.0615 1.1823 1.5243 1.3959 1.2886 1.8624 1.2579 1.3155 1.3618 1.3672 2.1328 7.3575 1.1243 1.1340 2.1580 1.0783 1.0823 1.0771 1.0464 1.0511 1.0840 1.0997 1.0610 2.1984 5.7001 5.8710 1.0395 1.0391 1.0625 1.0649 1.0650 1.0630 1.0949 1.0976 1.0955 1.0951 1.1004 1.1051 1.0981 1.0982 1.0851 1.0886 1.0928 1.0953 1.1003
irintensity: 2.8411 0.8149 0.3767 0.2283 0.7859 1.9610 10.6466 0.1677 1.8666 10.7143 0.1666 8.6516 1.7615 8.5042 17.3140 8.3396 0.6588 0.3792 0.3867 15.2146 3.4608 0.1486 5.2895 3.6440 80.9531 12.1721 27.4504 0.3960 2.1897 55.5577 3.2381 35.9374 74.0794 3.3314 9.1336 41.1954 4.3101 70.0479 4.0053 11.9832 7.7110 0.1957 8.6658 0.1789 0.5990 0.3343 3.3419 3.4277 2.1870 1.9160 0.9052 8.3486 33.4465 13.8074 8.4471 1.5331 5.1366 0.1892 3.6185 12.5745 0.4488 8.1102 9.5841 2.1257 6.3821 3.1554 2.2089 37.7802 0.4606 18.4386 2.7296 17.4302 5.6359 33.2858 9.1954 14.6726 4.5185 10.0011 25.8655 6.9770 7.0512 0.5010 2.5903 88.1508 63.3586 16.3108 18.3262 43.0874 23.9296 18.6434 4.7597 14.1818 11.8964 30.7295 29.9117 1.2915 10.1448 0.4862 7.4221 25.2284 17.4581 11.1069
temp: 298.150 k
press: 1.00000 atm
elementType: 16 8 8 7 6 6 6 6 6 6 6 6 6 6 6 6 6 1 1 1 1 1 1 1 1 1 1 1 1 1 1 1 1 1 1 1
symmnumber: 1
zpe: 772328.9 jmol-1
zpe.correction: 0.294165 hartree
zpe.thermalcorrener: 0.312680 hartree
zpe.thermalcorrenthalpy: 0.313624 hartree
zpe.thermalcorrgfe: 0.246765 hartree
zpe.sumelectzpe: -1108.576383 hartree
zpe.sumelectthermal: -1108.557868 hartree
zpe.sumelectthermalent: -1108.556924 hartree
zpe.sumelectthermalfe: -1108.623782 hartree
dipole: 4.5108 -1.6238 -1.8557
dipole: 5.1407
quadrupole: -110.5899 -101.8966 -110.4870
quadrupole: 8.5334 3.4163 -5.0757
quadrupole: -2.9321 5.7612 -2.8291 8.5334 3.4163 -5.0757
hfenergy: -1108.8705473 hartree
pointgroup: C01 [X(C13H19N1O2S1)]
dipole: 1.8001757 -0.4037508 -0.8288295 debye
polarizability: 222.8625009|0.9721137|182.8335402|-1.4071447|-6.8020591|157.6660213 unknown
InChI: InChI=1S/C11H13.C2H6NO2S/c1-2-6-10(7-3-1)11-8-4-5-9-11;1-3(2)6(4)5/h1-3,6-7H,4-5,8-9H2;1-2H3
charge 0 multiplicity 1
36 atoms
S  -1.540514 0.922566 0.371123
O  -1.552257 0.938752 2.014783
O  -2.970081 1.085505 -0.425202
N  -0.422571 2.355422 -0.323644
C  -0.588421 -0.991367 -0.293278
C  -1.364979 -1.284786 -1.589987
C  -1.138936 -1.911391 0.806722
C  -2.337655 -2.450094 -1.234249
C  -2.539213 -2.328382 0.297951
C  0.866152 -0.679072 -0.322206
C  1.47519 -0.117412 -1.481068
C  1.6833 -0.92885 0.818821
C  -1.28916 3.461093 -0.811869
C  0.531536 2.776416 0.736211
C  2.856342 0.159188 -1.507495
C  3.065219 -0.650302 0.792004
C  3.658835 -0.108167 -0.372423
H  -0.676954 -1.54161 -2.414235
H  -1.954515 -0.400843 -1.905041
H  -1.153309 -1.427325 1.800781
H  -0.474431 -2.798085 0.86916
H  -1.86955 -3.423359 -1.477781
H  -3.285544 -2.37933 -1.793785
H  -3.277183 -1.537027 0.522961
H  -2.890582 -3.265923 0.761762
H  0.859848 0.118719 -2.354709
H  1.235907 -1.344494 1.726855
H  -2.160402 3.03403 -1.336332
H  -0.690017 4.047914 -1.533127
H  -1.652771 4.133017 -0.005289
H  1.138066 1.917854 1.063943
H  0.038696 3.228113 1.622357
H  1.206765 3.524497 0.280133
H  3.308079 0.58872 -2.40828
H  3.678705 -0.854095 1.676453
H  4.733108 0.106304 -0.39422
