program: Gaussian 09
title: 000026332
version: EM64L-G09RevD.01
frameworkgroup: C1[X(C7H10N2)]
method: RPBEPBE
basis: SDD
operation: Freq
keyword: #pfreq=noraman
keyword: PBEPBE/SDD
title: #p freq=noraman PBEPBE/SDD
converged: YES YES NO NO
title: Mulliken charges:
elementType: N N C C C C C C C H H H H H H H H H H
charge: -0.039771 0.016196 -0.485318 0.233015 -0.675386 0.206148 -0.425904 -0.378785 -0.779763 0.207995 0.226355 0.242070 0.220593 0.215627 0.250710 0.248775 0.232282 0.231119 0.254043
chargesum: 0.00000
title: Mulliken charges with hydrogens summed into heavy atoms:
elementType: N N C C C C C C C
charge: -0.039771 0.016196 -0.050969 0.233015 0.002904 0.206148 -0.175194 -0.130011 -0.062319
polarizability: 1.14354716e+02 -3.79564351e+00 8.92407701e+01 5.26715893e+00 2.30817627e+00 5.39672033e+01
1716.lowfreq: -60.3740 -15.8749 -9.5788 0.0002 0.0005 0.0007 9.0838 30.1908 122.1139
frequency: -60.3461 27.1407 122.1063 177.3172 202.3564 272.5432 310.4338 395.5687 456.9421 525.9971 549.2213 607.1079 683.2976 763.0208 784.3514 877.8478 911.8574 930.6457 958.9408 983.1275 1012.3340 1047.8439 1065.0205 1072.5882 1144.3583 1226.3105 1230.0594 1273.3429 1277.5854 1324.7825 1380.4198 1390.3829 1397.1005 1409.8522 1461.1625 1462.0421 1467.9496 1473.4737 1487.4108 1515.0521 1539.8668 2985.7271 2986.8864 2997.2980 3052.9163 3066.2347 3084.5045 3096.4549 3116.1393 3132.6543 3138.2011
redmass: 1.0314 2.5108 3.2226 2.9489 1.2247 1.9431 3.1288 2.5773 6.8862 4.0155 4.9801 3.7488 5.9477 2.2653 1.2594 1.4621 2.8481 1.4374 2.3860 2.6257 2.5991 1.6026 1.8441 1.8347 2.4999 2.6080 1.8726 1.9278 1.5763 1.6960 1.2764 1.3508 1.8618 2.4644 1.1583 1.1205 1.0461 1.0434 1.0774 5.4861 4.5452 1.0347 1.0379 1.0596 1.1016 1.0973 1.1007 1.1012 1.0986 1.0904 1.0951
irintensity: 0.5174 0.0470 0.5883 1.9253 0.6448 2.1307 4.2335 0.7427 6.8534 0.3827 1.3770 0.9408 0.9043 7.4456 3.3245 19.9785 0.9706 0.3961 12.6649 14.9319 1.4085 11.2482 11.3842 5.2592 9.7697 1.8979 9.9365 1.6656 7.6865 1.5706 8.4410 13.1021 6.6025 55.8685 27.0598 16.4203 13.9567 15.2032 13.0051 43.6886 11.3047 38.0803 13.7990 24.8502 6.9574 16.7330 45.1149 32.3119 8.3763 35.7381 4.4081
temp: 298.150 k
press: 1.00000 atm
elementType: 7 7 6 6 6 6 6 6 6 1 1 1 1 1 1 1 1 1 1
symmnumber: 1
zpe: 411849.0 jmol-1
zpe.correction: 0.156865 hartree
zpe.thermalcorrener: 0.165223 hartree
zpe.thermalcorrenthalpy: 0.166167 hartree
zpe.thermalcorrgfe: 0.122794 hartree
zpe.sumelectzpe: -381.562218 hartree
zpe.sumelectthermal: -381.553860 hartree
zpe.sumelectthermalent: -381.552916 hartree
zpe.sumelectthermalfe: -381.596289 hartree
dipole: -0.2274 -1.0355 -0.0662
dipole: 1.0622
quadrupole: -45.5864 -59.8444 -55.0865
quadrupole: -5.2906 0.7968 -1.2607
quadrupole: 7.9194 -6.3386 -1.5807 -5.2906 0.7968 -1.2607
hfenergy: -381.7190833 hartree
pointgroup: C01 [X(C7H10N2)]
dipole: -0.0864756 -0.4077137 0.0306357 debye
dipolederiv: -0.4960225 0.0576707 -0.010129 0.0744598 -0.2479601 -0.010458 -0.0279546 -0.0029563 -0.267873 -0.0519901 -0.0545893 0.0351556 -0.0662361 -0.2483579 -0.0045503 0.0358525 -0.0113031 -0.2492171 -0.1018816 -0.0832284 0.0328813 -0.2215972 0.0861468 0.000704 0.1120916 0.0381775 0.0402461 0.6425439 0.1098263 0.0193423 0.4214421 0.0116111 0.0747055 0.0836252 0.0309855 0.0607462 -0.0009744 -0.0171544 0.0212089 0.0292485 0.060701 0.0498338 -0.0966288 0.0146423 0.0298049 0.2772584 -0.2334247 0.0216305 -0.5710904 0.3833738 -0.0761915 0.0303611 -0.0363651 0.1098348 -0.1799281 -0.028527 0.0036615 -0.4279727 0.1120009 -0.0609084 -0.0260469 -0.0013557 -0.0416038 0.1264131 0.0207277 0.045044 0.4462271 -0.1606144 0.0679892 0.0234885 0.0018809 -0.0526975 -0.1868802 0.189631 -0.0346613 0.1560198 -0.0937479 0.0263996 -0.0322675 0.0279467 0.0359772 -0.0046995 0.0415555 -0.0304073 0.1143949 -0.0936875 0.1029672 -0.0208219 0.058169 0.0479376 0.029897 -0.008496 0.0090892 -0.0278305 0.0095825 -0.1207491 -0.0221274 -0.0831481 -0.0562038 0.0635679 0.1193833 -0.0428078 0.0767913 -0.03648 0.069207 -0.0225519 0.0404543 0.0563689 -0.2029591 -0.1027462 -0.0155009 -0.113717 0.0718983 0.0043829 -0.0101264 0.0017529 0.0644054 0.1021378 -0.0200472 0.0032457 0.0194484 -0.0285828 -0.1366544 0.0350238 -0.0844924 -0.075852 -0.0200337 0.0892144 -0.030906 0.1173994 0.0113566 0.0188306 -0.0303471 0.015149 0.1271457 -0.1072528 -0.0154464 -0.0387515 -0.0439027 0.0947814 -0.0057526 -0.0395267 -0.0010743 0.124824 -0.0154996 0.0324046 0.1057677 0.0174333 0.0623937 0.039858 0.1271248 -0.0051077 -0.0006224 0.05499 0.0246967 -0.0878679 0.0230391 0.0605696 -0.0390226 -0.1112099 0.0106967 -0.0679366 0.0713134 -0.1214505 -0.0059951 -0.0235571 -0.0549851 -0.0005908 -0.0079582 -0.014052 0.1147154 unknown
polarizability: 114.3264387|-2.8094478|89.1446525|6.1402231|-2.6395959|54.0915982 unknown
InChI: InChI=1S/C7H10N2/c1-3-7-5-8-4-6(2)9-7/h4-5H,3H2,1-2H3
charge 0 multiplicity 1
19 atoms
N  0.063361 -0.843546 -0.159585
N  0.88643 1.879967 -0.051806
C  -2.288834 -0.213328 -0.540577
C  -0.841642 0.177283 -0.325261
C  -2.914501 -0.842415 0.731785
C  1.373094 -0.511245 0.059163
C  -0.416404 1.52954 -0.27295
C  1.769399 0.855301 0.114013
C  2.367238 -1.63694 0.23332
H  -2.871518 0.673031 -0.852726
H  -2.334547 -0.951061 -1.363644
H  -2.324004 -1.71973 1.047873
H  -3.951417 -1.168851 0.535369
H  -2.933318 -0.118813 1.566891
H  -1.126792 2.351921 -0.409166
H  2.81394 1.133831 0.291926
H  3.150186 -1.605582 -0.546917
H  2.87828 -1.574399 1.211878
H  1.84325 -2.603065 0.168614
