program: Gaussian 09
title: 000274002
version: EM64L-G09RevD.01
frameworkgroup: C1[X(C21H18N2O)]
method: RPBEPBE
basis: SDD
operation: Freq
keyword: #p
keyword: freq=noraman
keyword: PBEPBE/SDD
title: #p freq=noraman PBEPBE/SDD
converged: YES YES NO NO
title: Mulliken charges:
elementType: O N N C C C C C C C C C C C C C C C C C C C C C H H H H H H H H H H H H H H H H H H
charge: -0.222840 -0.107216 -0.025386 0.314721 0.318653 -0.403967 -0.024171 0.328085 -0.809992 -0.379061 -0.382578 -0.377434 -0.379731 -0.244788 -0.236813 -0.240541 -0.236396 -0.228547 -0.240119 0.348057 -0.331998 -0.381683 -0.250059 -0.160395 0.245722 0.268943 0.222883 0.243608 0.227204 0.248260 0.248771 0.269158 0.225380 0.224901 0.229317 0.225698 0.226500 0.228728 0.242864 0.258298 0.255982 0.261981
chargesum: 0.00000
title: Mulliken charges with hydrogens summed into heavy atoms:
elementType: O N N C C C C C C C C C C C C C C C C C C C C C
charge: -0.222840 -0.107216 -0.025386 0.314721 0.318653 -0.158245 -0.024171 0.328085 -0.074558 -0.151856 -0.134317 -0.128664 -0.110572 -0.019409 -0.011912 -0.011224 -0.010698 -0.002046 -0.011390 0.348057 -0.089135 -0.123386 0.005924 0.101585
polarizability: 4.21053807e+02 1.04181296e+01 2.95664531e+02 -7.98707481e+00 6.77019115e+00 1.48689596e+02
1716.lowfreq: -7.4908 -0.0010 -0.0008 -0.0007 0.8995 3.4477 17.5966 27.8808 32.3582
frequency: 17.4394 27.6410 32.3470 39.0688 41.8217 49.9812 81.0426 91.7160 111.7966 142.4397 144.4959 168.7590 191.6855 215.9275 237.0086 271.9913 285.2950 303.6952 328.6757 392.4617 400.2287 404.3463 407.7104 446.5685 476.7704 488.7655 515.0513 554.8896 558.5448 585.5967 614.8724 616.9496 630.1319 662.6615 666.6230 697.6204 699.7710 731.8508 752.0077 761.6350 767.4999 783.9862 806.4060 830.8771 846.3981 853.9636 862.0245 867.7840 879.0618 881.5186 917.7021 919.9369 935.3425 956.9361 969.9537 974.2469 985.3742 987.9882 989.6716 993.9412 1001.5847 1014.2401 1025.1092 1025.7630 1039.6170 1051.3743 1070.7094 1076.4347 1089.9419 1103.0492 1135.4702 1171.2474 1173.5675 1183.5689 1195.8901 1204.2508 1241.3329 1270.8963 1292.5284 1309.3648 1315.0698 1320.0608 1344.1266 1368.7362 1380.1056 1383.5017 1400.1525 1433.2098 1435.3321 1442.2571 1465.4284 1476.4370 1481.6349 1486.9910 1514.8516 1538.5086 1580.3279 1585.3514 1608.3946 1610.3112 1613.2595 1622.5319 2974.1066 3041.5612 3060.3300 3097.5130 3100.4074 3122.5652 3123.7104 3129.5019 3132.3188 3142.5730 3144.7377 3152.2027 3156.6201 3165.7473 3167.4938 3219.4115 3234.7494 3268.2785
redmass: 5.2267 3.8225 4.4854 4.6237 4.3156 5.2739 4.0523 5.0184 5.0405 4.5709 4.7605 1.1648 3.9305 4.3845 4.1059 4.2827 5.6455 4.0761 3.7084 5.1437 3.3789 2.9187 3.3303 4.6885 6.4911 4.4726 4.4552 4.3278 2.5486 2.9829 6.1496 6.3754 4.1976 4.9937 6.0140 1.7473 1.7625 1.2687 3.7087 2.7031 2.4899 2.1135 1.3653 4.0697 1.3614 1.3778 1.4500 5.9774 1.3632 4.3170 1.4774 1.5101 1.4688 3.0536 3.7578 1.4578 1.4837 5.5964 4.6607 1.3209 1.3263 1.6876 2.2900 2.1007 1.5367 2.3406 1.8204 1.7757 1.6611 2.4380 1.5965 1.0559 1.0520 1.1146 1.1241 1.5003 2.3595 4.7229 2.4104 1.7510 1.3963 1.5450 1.7922 2.4734 5.5623 8.4611 1.2048 2.3111 2.2844 1.0760 5.2050 1.2311 2.2757 1.9627 6.0202 8.1408 5.6415 6.2448 6.1409 6.2046 6.7996 7.3285 1.0411 1.0884 1.0916 1.0897 1.0977 1.0844 1.0846 1.0872 1.0880 1.0925 1.0930 1.0956 1.0959 1.1014 1.1003 1.0925 1.0980 1.1082
irintensity: 1.0752 0.2283 0.8197 0.4872 0.7744 0.5833 0.3703 0.6014 0.3941 0.3917 0.5902 1.8332 2.0571 1.4207 5.2575 4.2371 5.4224 2.8795 3.6073 3.1121 0.6684 1.1264 0.9502 4.4342 2.0657 8.5311 1.2047 7.0473 5.2895 8.3212 0.5332 0.1473 16.8071 2.8255 12.3840 27.5013 58.7859 83.5639 6.3626 73.1093 96.2449 13.4520 30.3436 21.3358 0.0265 7.4846 9.2766 4.9220 0.7261 7.0864 8.8702 16.1798 5.4807 38.6266 11.8792 0.1832 1.0114 0.0149 0.3278 0.1528 1.5691 24.3675 13.8554 10.8240 5.5239 17.8688 2.7545 11.6515 5.8395 12.6042 8.7974 0.6980 0.0186 16.7217 1.0398 3.1105 20.0251 15.1539 49.7072 1.4934 9.0486 2.3188 29.6621 1.6824 5.3166 1.4334 19.2194 4.2150 11.1135 21.8333 12.5376 26.8856 12.5311 13.4881 34.1549 5.4302 8.9052 2.9487 1.3685 10.5915 9.3132 46.0000 9.8680 20.2288 18.0624 10.5266 19.8828 4.4711 2.9675 0.8593 2.8063 23.2469 31.7602 33.7736 32.3419 24.2948 25.0822 6.4870 0.8793 0.0577
temp: 298.150 k
press: 1.00000 atm
elementType: 8 7 7 6 6 6 6 6 6 6 6 6 6 6 6 6 6 6 6 6 6 6 6 6 1 1 1 1 1 1 1 1 1 1 1 1 1 1 1 1 1 1
symmnumber: 1
zpe: 863553.3 jmol-1
zpe.correction: 0.328910 hartree
zpe.thermalcorrener: 0.350065 hartree
zpe.thermalcorrenthalpy: 0.351009 hartree
zpe.thermalcorrgfe: 0.275414 hartree
zpe.sumelectzpe: -994.016504 hartree
zpe.sumelectthermal: -993.995349 hartree
zpe.sumelectthermalent: -993.994405 hartree
zpe.sumelectthermalfe: -994.069999 hartree
dipole: -1.4828 0.6250 -1.8204
dipole: 2.4297
quadrupole: -112.5719 -129.1599 -140.0453
quadrupole: 4.2251 -2.2485 5.2568
quadrupole: 14.6871 -1.9008 -12.7863 4.2251 -2.2485 5.2568
hfenergy: -994.3454136 hartree
pointgroup: C01 [X(C21H18N2O1)]
dipole: -0.4931506 -0.4170072 0.7047532 debye
polarizability: 400.0677543|45.2246555|313.5783682|29.5033209|-0.1906936|151.7618118 unknown
InChI: InChI=1S/C21H18N2O/c1-17(18-9-4-2-5-10-18)15-21(19-11-6-3-7-12-19)23-22-16-20-13-8-14-24-20/h2-16H,1H3
charge 0 multiplicity 1
42 atoms
O  -3.840555 0.134457 -1.34841
N  -0.124153 1.967532 -0.568646
N  -1.305855 1.321697 -0.773865
C  0.672969 -1.171927 -0.539679
C  0.795264 -2.553722 0.018198
C  1.087434 -0.086366 0.194397
C  0.992213 1.343764 -0.195701
C  2.210212 2.197939 -0.077651
C  0.082598 -1.019524 -1.928421
C  1.791853 -2.899228 0.976716
C  -0.09634 -3.5780 -0.409797
C  3.496338 1.602852 0.037069
C  2.114091 3.618247 -0.086095
C  1.877961 -4.205182 1.500722
C  -0.015467 -4.884392 0.118374
C  0.971446 -5.206301 1.07777
C  4.654229 2.404312 0.144552
C  3.270225 4.415882 0.013462
C  4.547124 3.813376 0.13381
C  -3.636124 0.968995 -0.224252
C  -2.329859 1.530212 0.029749
C  -4.836622 1.084899 0.481774
C  -5.826557 0.305848 -0.220551
C  -5.190434 -0.252442 -1.319109
H  1.53931 -0.25454 1.181788
H  -1.021249 -0.931479 -1.884947
H  0.347309 -1.877138 -2.571131
H  0.436923 -0.09365 -2.409456
H  2.525228 -2.148594 1.29233
H  -0.872993 -3.343206 -1.145111
H  3.589098 0.511316 0.017002
H  1.12238 4.072366 -0.17556
H  2.659933 -4.447172 2.22945
H  -0.722709 -5.650618 -0.218841
H  1.040196 -6.221922 1.482992
H  5.638628 1.930127 0.22804
H  3.180391 5.508063 0.004346
H  5.445204 4.435735 0.217108
H  -2.241393 2.138517 0.945723
H  -4.985665 1.663873 1.391397
H  -6.871877 0.176542 0.051968
H  -5.509003 -0.901651 -2.129915
