program: Gaussian 09
title: 000273969
version: EM64L-G09RevD.01
frameworkgroup: C1[X(C13H10N2O3)]
method: RPBEPBE
basis: SDD
operation: Freq
keyword: #p
keyword: freq=noraman
keyword: PBEPBE/SDD
title: #p freq=noraman PBEPBE/SDD
converged: NO YES NO NO
title: Mulliken charges:
elementType: O O O N N C C C C C C C C C C C C C H H H H H H H H H H
charge: -0.263584 -0.256598 -0.235975 -0.088704 -0.056120 0.219915 0.178334 -0.485592 0.476207 -0.329229 -0.202005 -0.374166 -0.372194 0.327923 -0.348963 -0.250680 -0.350868 -0.155378 0.294815 0.254741 0.241029 0.241032 0.235383 0.245004 0.278675 0.257123 0.256317 0.263562
chargesum: 0.00000
title: Mulliken charges with hydrogens summed into heavy atoms:
elementType: O O O N N C C C C C C C C C C C C C
charge: -0.263584 -0.256598 -0.235975 -0.088704 -0.056120 0.219915 0.178334 -0.190777 0.476207 -0.074488 0.280055 -0.138783 -0.127190 0.327923 -0.070288 0.006443 -0.094551 0.108183
polarizability: 4.81168489e+02 1.46951328e+01 1.58415200e+02 8.75517297e-03 3.59582573e-03 6.77332980e+01
1716.lowfreq: -15.6371 -9.4987 -2.7049 -0.0014 0.0001 0.0012 1.9757 30.7566 35.0914
frequency: -15.0069 30.7102 35.0225 39.6745 91.5411 106.9790 153.5005 198.2712 215.5938 226.5490 259.5100 268.1694 355.6509 387.6602 392.4436 441.4525 451.3443 515.6736 570.8140 585.8851 611.7847 628.0605 652.0542 681.1979 723.8795 736.5456 766.4271 781.1517 795.1754 812.8927 827.7301 841.2251 869.9093 892.5584 906.6998 911.5877 931.9167 933.6394 964.2781 971.0735 980.6273 981.4597 1013.0621 1056.2008 1059.9632 1065.1552 1120.2047 1131.8510 1135.7183 1169.2470 1189.0877 1237.2240 1253.3840 1261.7892 1301.7286 1351.4627 1365.4574 1370.3147 1387.4663 1455.7215 1464.8197 1476.7924 1486.3513 1502.4972 1555.7617 1599.6068 1609.5404 1623.5049 3016.4120 3033.5823 3059.4649 3095.3313 3142.8215 3184.8666 3188.2477 3224.5558 3244.8653 3268.6596
redmass: 2.3097 4.8862 6.6945 6.3414 6.3932 5.8222 5.5326 3.6283 5.9358 7.9456 5.0028 6.6920 3.9815 5.3610 6.1354 3.4278 7.2786 6.0504 6.4962 3.0769 4.2006 7.6604 4.3119 9.6568 4.3105 1.2702 6.7098 5.0349 5.3694 1.3513 1.3140 10.8662 6.4722 1.3754 1.3815 3.7966 1.3475 3.6808 1.4771 5.2701 4.1179 1.5289 1.5901 3.0621 3.7975 1.4565 1.0367 1.4435 1.5662 2.7746 1.7468 1.5318 1.7652 2.1892 1.7414 2.1879 1.3249 2.6029 4.2685 4.5029 4.5557 3.3130 1.2073 5.6912 6.1775 8.1926 7.8198 7.8940 1.0534 1.0883 1.0884 1.1190 1.0898 1.0952 1.0940 1.0915 1.0993 1.1081
irintensity: 14.9224 0.3985 1.1958 1.1220 2.8395 0.3166 4.1761 0.3729 1.1875 0.6357 7.4594 0.1082 12.3346 5.7944 12.3601 6.1973 9.3491 1.8215 3.9082 9.7112 16.1445 9.5067 1.4728 0.5353 4.2172 84.5576 26.7056 8.5516 16.4366 42.4779 23.1315 21.1315 8.0918 0.2375 14.1549 6.7745 8.3447 6.4504 40.3699 47.2379 133.3397 11.0654 26.0214 62.1481 16.4457 4.3274 0.0077 33.0900 3.3831 2.5862 36.6716 8.4341 134.3789 252.2253 30.1229 20.0659 3.3288 3.3912 69.7441 257.8650 27.9756 108.0195 20.4775 6.7346 28.7207 78.0204 93.3884 78.0364 157.9604 22.7457 9.4320 30.2708 7.1482 5.3869 6.8341 8.4163 0.2299 0.0070
temp: 298.150 k
press: 1.00000 atm
elementType: 8 8 8 7 7 6 6 6 6 6 6 6 6 6 6 6 6 6 1 1 1 1 1 1 1 1 1 1
symmnumber: 1
zpe: 533720.1 jmol-1
zpe.correction: 0.203283 hartree
zpe.thermalcorrener: 0.217515 hartree
zpe.thermalcorrenthalpy: 0.218459 hartree
zpe.thermalcorrgfe: 0.159759 hartree
zpe.sumelectzpe: -835.198548 hartree
zpe.sumelectthermal: -835.184316 hartree
zpe.sumelectthermalent: -835.183372 hartree
zpe.sumelectthermalfe: -835.242072 hartree
dipole: 0.2749 0.7348 0.0003
dipole: 0.7845
quadrupole: -66.5467 -95.3066 -107.2876
quadrupole: -5.1737 -0.0005 0.0000
quadrupole: 23.1669 -5.5930 -17.5739 -5.1737 -0.0005 0.0000
hfenergy: -835.4018314 hartree
pointgroup: C01 [X(C13H10N2O3)]
dipole: 0.1106805 -0.2881374 -0.0001141 debye
polarizability: 481.3998223|-11.8840122|158.1838667|-0.0087861|0.0035195|67.733298 unknown
InChI: InChI=1S/C13H10N2O3/c1-2-11(16-5-1)8-15-14-7-10-3-4-12-13(6-10)18-9-17-12/h1-8H,9H2
charge 0 multiplicity 1
28 atoms
O  4.219248 1.934128 -0.000038
O  5.702201 0.043812 -0.000445
O  -5.211375 1.352201 0.000191
N  -0.732279 -0.024971 0.000183
N  -2.073172 -0.516869 -0.000153
C  3.478466 0.725066 -0.000052
C  4.357878 -0.385585 -0.000292
C  2.097933 0.579464 0.000128
C  1.586031 -0.761553 0.00007
C  3.886288 -1.701035 -0.000367
C  5.648913 1.534377 -0.000221
C  2.478629 -1.871586 -0.000194
C  0.146391 -1.014178 0.000279
C  -4.363507 0.211498 -0.000103
C  -5.154855 -0.940528 -0.000044
C  -6.530052 -0.516531 0.00001
C  -2.947939 0.477656 -0.000248
C  -6.526313 0.87325 0.000073
H  1.40822 1.426328 0.000325
H  4.571613 -2.551725 -0.000553
H  6.130342 1.906884 0.920071
H  6.130179 1.907155 -0.920487
H  2.065027 -2.886293 -0.000244
H  -0.199501 -2.063223 0.0000
H  -4.771757 -1.958166 -0.000141
H  -7.41136 -1.154697 -0.000022
H  -2.62545 1.532397 -0.00005
H  -7.304398 1.631425 0.000123
