program: Gaussian 09
title: 000273964
version: EM64L-G09RevD.01
frameworkgroup: C1[X(C13H12N2O)]
method: RPBEPBE
basis: SDD
operation: Freq
keyword: #p
keyword: freq=noraman
keyword: PBEPBE/SDD
title: #p freq=noraman PBEPBE/SDD
converged: NO YES NO YES
title: Mulliken charges:
elementType: O N N C C C C C C C C C C C C C H H H H H H H H H H H H
charge: -0.235593 -0.083817 -0.061141 0.336460 0.261695 -0.408582 -0.352580 -0.825364 -0.222345 -0.239215 -0.370636 0.328229 -0.348311 -0.250556 -0.350123 -0.154982 0.230997 0.273421 0.236014 0.230548 0.236025 0.228999 0.230668 0.253629 0.278671 0.257368 0.256735 0.263785
chargesum: 0.00000
title: Mulliken charges with hydrogens summed into heavy atoms:
elementType: O N N C C C C C C C C C C C C C
charge: -0.235593 -0.083817 -0.061141 0.336460 0.261695 -0.177585 -0.079159 -0.122777 0.006655 -0.008546 -0.117007 0.328229 -0.069640 0.006813 -0.093388 0.108803
polarizability: 4.25646877e+02 4.25168828e+00 1.55493740e+02 -1.75682043e-02 5.72715813e-03 6.61695508e+01
1716.lowfreq: -3.6133 -0.0009 -0.0003 0.0011 2.0984 9.4402 32.5505 43.0420 47.6627
frequency: 32.5297 43.0310 47.6547 100.2298 126.7579 151.0822 155.0537 175.2432 210.4005 220.2253 289.6449 313.4019 374.4998 381.0413 461.2363 469.8025 517.6922 532.5921 548.9150 585.8180 633.8962 650.9911 729.7474 736.9614 773.9578 775.7862 784.9274 828.2089 859.5156 870.3124 885.4133 892.9664 911.2534 959.7052 967.9024 969.8022 983.1273 988.3720 1001.4970 1013.0039 1044.6914 1044.7468 1056.2558 1106.2840 1135.4126 1169.0375 1174.2480 1194.7544 1236.6059 1243.8283 1289.0041 1304.4127 1348.7822 1370.8100 1381.5417 1400.8918 1437.7626 1461.7988 1469.0288 1474.9495 1484.2708 1501.2840 1552.8319 1577.2715 1607.1547 1612.4743 2978.7081 3056.0147 3056.3097 3060.2117 3088.1618 3121.9816 3135.6938 3151.4924 3166.5271 3224.2307 3244.8824 3268.3839
redmass: 4.4182 5.6087 5.0175 3.9277 4.9598 1.1536 3.7484 2.9533 5.3854 3.3300 5.7631 3.0481 5.5290 3.4328 2.8649 6.3595 5.3990 3.3506 5.7708 3.0707 6.2824 4.2876 2.3744 1.2740 1.4076 4.8470 4.9658 1.3138 4.0340 6.3317 1.3037 1.3741 3.8228 1.4228 1.4125 4.7974 1.5087 1.6199 1.3531 1.5747 1.5667 2.0796 3.0377 1.9255 1.5900 2.7561 1.0621 2.0149 1.5713 2.2156 1.5502 1.6227 2.3571 2.6667 4.4404 1.2731 2.2784 3.4667 3.0624 1.0457 1.2687 4.3336 5.8634 6.3811 7.5934 6.2151 1.0377 1.0873 1.0976 1.0886 1.0981 1.0864 1.0894 1.0942 1.1000 1.0915 1.0993 1.1081
irintensity: 0.1237 2.4377 1.0429 1.0704 0.1912 2.2525 3.4657 0.0797 0.3381 0.2518 1.3956 22.7133 7.4946 0.3734 12.3342 10.8809 1.9446 3.4142 0.4401 9.0474 6.7323 2.8677 23.2519 78.2365 57.9158 14.1399 10.3107 24.1051 1.6948 6.4452 0.2885 0.1361 8.2420 25.3289 10.5974 1.1227 8.8821 0.3041 1.2361 27.1653 6.7016 7.3187 49.2311 3.0772 5.0490 3.5709 4.3574 1.9635 8.2039 11.2029 11.2265 54.7237 6.3474 2.9577 3.6330 14.1611 8.0151 51.2585 24.9077 13.5760 24.9157 5.2297 21.5409 1.5111 190.7384 5.7909 23.1834 32.1708 17.6397 0.2764 26.3159 9.6896 15.6206 23.5970 34.6906 7.5417 0.2365 0.0080
temp: 298.150 k
press: 1.00000 atm
elementType: 8 7 7 6 6 6 6 6 6 6 6 6 6 6 6 6 1 1 1 1 1 1 1 1 1 1 1 1
symmnumber: 1
zpe: 569344.3 jmol-1
zpe.correction: 0.216852 hartree
zpe.thermalcorrener: 0.231076 hartree
zpe.thermalcorrenthalpy: 0.232021 hartree
zpe.thermalcorrgfe: 0.174056 hartree
zpe.sumelectzpe: -686.117571 hartree
zpe.sumelectthermal: -686.103346 hartree
zpe.sumelectthermalent: -686.102402 hartree
zpe.sumelectthermalfe: -686.160366 hartree
dipole: 0.3261 1.4102 0.0000
dipole: 1.4474
quadrupole: -62.8523 -84.4000 -99.1001
quadrupole: 0.8855 -0.0017 0.0009
quadrupole: 19.2652 -2.2826 -16.9826 0.8855 -0.0017 0.0009
hfenergy: -686.3344228 hartree
pointgroup: C01 [X(C13H12N2O1)]
dipole: 0.1346896 -0.5532885 -0.0000061 debye
polarizability: 425.7089689|-1.1395713|155.4316479|0.0175011|0.0059291|66.1695508 unknown
InChI: InChI=1S/C13H12N2O/c1-11-5-2-3-6-12(11)9-14-15-10-13-7-4-8-16-13/h2-10H,1H3
charge 0 multiplicity 1
28 atoms
O  4.569909 1.178147 0.000244
N  -0.05376 0.399647 -0.000114
N  1.213116 -0.262577 -0.000035
C  -3.510569 -1.004584 -0.000257
C  -2.451326 -0.036665 -0.000237
C  -4.847999 -0.538015 -0.000251
C  -2.766334 1.354853 -0.000188
C  -3.240572 -2.501771 -0.000307
C  -5.15015 0.842052 -0.000214
C  -4.101438 1.793872 -0.000179
C  -1.050835 -0.471365 -0.000283
C  3.57863 0.159601 0.000146
C  4.21044 -1.087125 0.000029
C  5.629459 -0.849124 0.000156
C  2.210159 0.609382 0.000152
C  5.80969 0.529133 0.000269
H  -5.66486 -1.269489 -0.000267
H  -1.935024 2.067125 -0.00017
H  -2.664665 -2.817697 0.88967
H  -4.188919 -3.064738 -0.000049
H  -2.665151 -2.817701 -0.890603
H  -6.195145 1.172022 -0.000209
H  -4.329727 2.865271 -0.000148
H  -0.822987 -1.549997 -0.000308
H  3.695719 -2.044946 -0.000087
H  6.418591 -1.598297 0.000148
H  2.0282 1.697138 0.000221
H  6.681449 1.177546 0.000372
