program: Gaussian 09
title: 000026410
version: EM64L-G09RevD.01
frameworkgroup: C1[X(C21H31N3O3)]
method: RPBEPBE
basis: SDD
operation: Freq
keyword: #p
keyword: freq=noraman
keyword: PBEPBE/SDD
title: #p freq=noraman PBEPBE/SDD
converged: YES YES NO NO
title: Mulliken charges:
elementType: O O O N N N C C C C C C C C C C C C C C C C C C C C C H H H H H H H H H H H H H H H H H H H H H H H H H H H H H H H
charge: -0.250723 -0.253414 -0.403740 -0.350211 -0.402626 -0.455423 0.004493 -0.455394 -0.411295 -0.028318 -0.397025 -0.397760 -0.385369 -0.450333 -0.424624 -0.411145 -0.401326 -0.377881 -0.499150 0.147727 0.174783 0.166417 0.563487 0.163387 -0.350038 -0.657393 -0.389727 0.171950 0.252003 0.191422 0.211694 0.207791 0.197586 0.200006 0.192257 0.197787 0.189447 0.191638 0.197027 0.200979 0.213620 0.252058 0.192392 0.208385 0.181544 0.202767 0.201908 0.193110 0.200977 0.299520 0.311553 0.213394 0.220019 0.307472 0.254119 0.213627 0.309206 0.355363
chargesum: 0.00000
title: Mulliken charges with hydrogens summed into heavy atoms:
elementType: O O O N N N C C C C C C C C C C C C C C C C C C C C C
charge: -0.250723 -0.253414 -0.048377 -0.050691 -0.091073 -0.147950 0.176443 -0.052279 -0.005918 0.223685 -0.004762 -0.010526 0.003296 -0.035735 0.019826 -0.021216 0.003349 0.016206 -0.065737 0.147727 0.174783 0.166417 0.563487 0.163387 -0.095919 -0.443766 -0.080521
polarizability: 3.89611162e+02 9.44160350e+00 2.38364328e+02 -7.66898276e+00 1.82786185e+01 1.86170767e+02
1716.lowfreq: -7.2427 -0.0017 0.0009 0.0017 0.6267 3.8431 11.9016 18.5765 23.5003
frequency: 5.5363 16.9046 23.4517 30.0659 40.8432 48.2519 64.8896 71.3400 75.9860 95.6330 111.6095 129.0177 148.7554 166.2365 188.6586 200.5943 217.0025 225.9435 227.4240 233.2204 264.7983 280.8683 293.3252 312.0749 320.5910 328.9432 372.2724 380.8013 402.6122 426.4902 432.5855 452.5121 455.5710 457.9861 467.7801 480.6743 501.3758 535.0981 544.3739 552.4550 571.7821 613.4135 635.0461 636.4806 653.0141 659.6736 699.8111 722.8869 749.5998 771.7373 776.3128 782.9533 784.1266 798.4830 826.4047 829.7541 833.5056 844.8906 860.3885 861.9037 879.1886 884.0325 892.7741 912.5135 922.9329 927.2847 968.7609 971.4400 973.1194 980.4782 988.9559 1010.1047 1043.7584 1048.5741 1050.5273 1052.1269 1064.0149 1077.0674 1089.0649 1102.7564 1112.4251 1115.0382 1129.0791 1147.2413 1151.6022 1156.9433 1161.3167 1164.8085 1183.4921 1196.6989 1204.4297 1216.2344 1237.7804 1242.6967 1249.9609 1252.8973 1258.5893 1258.7508 1271.7159 1285.6708 1297.7161 1302.0157 1308.2548 1312.7242 1321.5164 1325.6854 1330.4767 1333.5257 1334.6033 1341.0288 1342.9832 1346.5923 1348.4213 1354.1121 1366.1989 1367.4319 1369.4228 1407.5084 1450.5211 1457.9355 1461.1177 1462.7968 1462.9296 1464.8761 1465.6056 1468.2308 1471.7147 1472.8832 1473.2904 1479.5932 1483.7162 1508.0742 1516.2118 1589.6295 1608.6604 1619.7938 1632.8992 2800.4454 2815.5771 2950.7023 2952.0074 2965.0381 2965.1355 2965.2992 2968.2940 2970.0404 2971.7156 2973.6491 2978.3580 2981.5480 3022.1783 3022.2836 3026.5976 3028.5430 3029.3830 3029.5531 3034.4279 3038.1629 3043.4692 3045.0133 3059.3353 3097.0918 3139.1091 3203.7825 3417.1529 3520.6142 3544.6959 3576.2161
redmass: 4.2971 3.5927 5.1303 3.6770 4.7966 4.1909 4.7496 5.8017 4.6565 4.0082 3.7586 3.5781 4.2298 4.4974 3.6307 2.7624 4.9860 3.2130 1.8110 4.2905 4.0299 2.9173 6.7948 2.0676 1.5136 1.7761 2.1521 2.7120 2.8109 3.4858 3.7053 3.1771 2.8586 2.4975 2.2270 2.3150 3.3689 2.4934 1.7274 2.2037 3.5765 2.5652 3.6303 1.8900 1.8632 1.7501 4.0747 4.5440 3.9730 2.5020 2.1335 2.9734 1.6779 2.3963 2.0275 2.7582 1.7314 2.0338 1.4717 2.3804 1.7570 2.3612 1.5782 3.8969 1.9410 1.4759 2.1670 2.7689 2.7916 1.4417 1.9630 2.8435 1.5179 1.7083 1.5108 1.6557 1.4234 2.5911 1.7015 1.5870 1.0452 2.5788 2.0389 2.3057 1.9187 1.5296 1.7501 1.8840 1.7227 1.4373 2.1658 1.6817 1.4362 1.3595 1.5681 1.2624 1.2811 1.3065 1.2921 1.5717 1.2424 1.7294 2.2452 1.4062 1.3191 1.4913 1.4408 1.3770 1.4231 1.4880 1.5115 1.7110 1.4565 1.4688 1.4320 2.2334 1.9670 4.9138 1.6327 1.1911 1.1089 1.1013 1.0876 1.1013 1.0863 1.1593 1.1014 1.1385 1.0989 1.1022 1.1324 2.7360 2.5377 6.0895 6.9629 6.0266 5.0388 1.0796 1.0710 1.0673 1.0838 1.0616 1.0603 1.0623 1.0623 1.0625 1.0638 1.0631 1.0635 1.0622 1.0984 1.0864 1.0932 1.0999 1.0965 1.0965 1.1023 1.1009 1.1019 1.1031 1.0989 1.0910 1.0908 1.0946 1.0740 1.0761 1.0775 1.0662
irintensity: 0.1153 0.9811 0.3456 0.0551 0.8226 2.9550 5.0128 6.0472 0.9028 2.0447 3.9635 0.0364 1.6043 0.9572 0.2612 1.3095 7.3154 0.2270 0.6896 1.9306 1.6545 16.8033 17.3442 21.1128 100.1434 2.7001 1.0065 5.1368 3.0896 5.1501 16.7512 5.0986 8.5062 2.6359 3.1886 2.8054 12.0968 48.4240 18.6269 19.5552 4.4498 19.1874 2.3799 61.3873 49.6408 0.3631 35.3226 10.0172 0.1363 8.6546 2.9754 9.7498 0.9835 2.2044 8.2019 15.8329 25.6681 8.6535 58.4271 6.1994 8.7033 13.5752 9.5662 49.9232 0.3455 16.2527 3.4831 9.5383 1.6012 2.4256 1.2347 5.3623 1.9451 0.4249 1.2503 1.3356 1.5521 65.1025 1.1563 13.0061 4.4784 0.7729 93.2317 1.7315 17.4199 8.1639 80.7651 17.8319 2.0432 3.8657 1.1577 191.1494 1.4309 0.6709 44.0876 3.2970 22.0981 11.9330 20.8702 42.2597 1.9331 18.5305 37.4458 4.6371 6.2619 22.2021 22.8969 2.4175 0.8440 0.6374 55.6398 38.4680 3.1347 5.1483 10.5796 296.6177 19.8133 55.8289 371.8211 99.2123 8.6375 3.7580 11.9582 9.6790 9.5862 16.1740 24.6295 141.3613 5.8558 7.8205 28.8450 330.2884 23.7147 73.8238 227.1496 207.0300 69.3330 94.8434 85.3228 32.4397 36.8340 72.7893 0.6813 41.5628 38.2542 76.8200 26.9375 13.0821 23.3855 33.0193 81.9305 43.6151 77.3942 5.0837 89.0958 38.0385 6.0651 26.7175 103.9463 140.0295 40.9431 17.7017 7.0081 6.5220 22.1547 11.3492 20.2578 33.5766
temp: 298.150 k
press: 1.00000 atm
elementType: 8 8 8 7 7 7 6 6 6 6 6 6 6 6 6 6 6 6 6 6 6 6 6 6 6 6 6 1 1 1 1 1 1 1 1 1 1 1 1 1 1 1 1 1 1 1 1 1 1 1 1 1 1 1 1 1 1 1
symmnumber: 1
zpe: 1298723.9 jmol-1
zpe.correction: 0.494658 hartree
zpe.thermalcorrener: 0.521321 hartree
zpe.thermalcorrenthalpy: 0.522265 hartree
zpe.thermalcorrgfe: 0.433537 hartree
zpe.sumelectzpe: -1206.725021 hartree
zpe.sumelectthermal: -1206.698358 hartree
zpe.sumelectthermalent: -1206.697414 hartree
zpe.sumelectthermalfe: -1206.786142 hartree
dipole: -2.1326 -0.1131 4.8394
dipole: 5.2897
quadrupole: -154.1100 -155.1773 -167.9500
quadrupole: -22.7934 2.1657 11.2110
quadrupole: 4.9691 3.9018 -8.8709 -22.7934 2.1657 11.2110
hfenergy: -1207.2196785 hartree
pointgroup: C01 [X(C21H31N3O3)]
dipole: -0.8448173 0.1036298 -1.8991128 debye
polarizability: 389.910687|-7.2496619|236.6260824|6.551818|20.3415922|187.6094879 unknown
InChI: InChI=1S/C21H31N3O3/c25-19-13-17(23-20(26)14-22-15-7-3-1-4-8-15)11-12-18(19)21(27)24-16-9-5-2-6-10-16/h11-13,15-16,22-25H,1-10,14H2
charge 0 multiplicity 1
58 atoms
O  4.590587 -1.643471 1.543718
O  -2.492712 1.19426 0.82288
O  2.765977 -2.777744 -0.590782
N  -5.107104 0.324566 0.508254
N  4.697352 0.454035 0.539411
N  -1.675144 -0.809913 -0.098773
C  -6.420926 0.528179 -0.136653
C  -7.30577 1.407034 0.777158
C  -7.122363 -0.823601 -0.421173
C  6.137905 0.650783 0.824517
C  -8.714005 1.622104 0.174504
C  -8.52817 -0.617313 -1.03336
C  -9.409571 0.272489 -0.124961
C  6.479632 2.160762 0.800216
C  7.027675 -0.134741 -0.179807
C  6.428017 2.761679 -0.628095
C  6.961914 0.460849 -1.604975
C  7.326831 1.965765 -1.60598
C  -4.071551 -0.300864 -0.3134
C  4.021313 -0.694133 0.923358
C  -2.679995 0.105173 0.205077
C  2.547182 -0.686004 0.588504
C  -0.276642 -0.71594 0.15064
C  1.931187 -1.767301 -0.099373
C  1.713962 0.368734 1.032294
C  0.537006 -1.781153 -0.318155
C  0.318311 0.376966 0.831294
H  -6.309657 1.059515 -1.122359
H  6.309557 0.237534 1.83602
H  -6.810259 2.384539 0.949068
H  -7.387579 0.906846 1.763098
H  -7.200284 -1.374307 0.537974
H  -6.503251 -1.44157 -1.101972
H  -9.330295 2.225813 0.86825
H  -8.627551 2.205044 -0.765986
H  -9.014453 -1.598117 -1.199259
H  -8.431089 -0.137197 -2.029702
H  -9.598731 -0.258727 0.830714
H  -10.395338 0.446779 -0.598257
H  7.507617 2.279251 1.195903
H  5.804509 2.71134 1.483793
H  6.717147 -1.194729 -0.175454
H  8.07354 -0.098841 0.188684
H  6.740178 3.823169 -0.594041
H  5.3847 2.763549 -1.011905
H  7.640674 -0.097871 -2.277373
H  5.937613 0.329006 -2.010147
H  8.386771 2.083109 -1.297693
H  7.24221 2.38341 -2.62796
H  -4.736976 1.176827 0.955992
H  4.209179 1.140887 -0.037992
H  -4.122061 0.01999 -1.389127
H  -4.167663 -1.407325 -0.312708
H  -1.985855 -1.669112 -0.559403
H  2.169532 1.197487 1.586108
H  0.081771 -2.619551 -0.864792
H  -0.306192 1.191832 1.198151
H  2.240435 -3.518381 -0.983765
