program: Gaussian 09
title: 000274174
version: EM64L-G09RevD.01
frameworkgroup: C1[X(C23H16Cl5NO4)]
method: RPBEPBE
basis: SDD
operation: Freq
keyword: #p
keyword: freq=noraman
keyword: PBEPBE/SDD
title: #p freq=noraman PBEPBE/SDD
converged: YES YES NO NO
title: Mulliken charges:
elementType: Cl Cl Cl Cl Cl O O O O N C C C C C C C C C C C C C C C C C C C C C C C H H H H H H H H H H H H H H H H
charge: 0.068249 0.058218 0.066878 0.067281 0.073110 -0.310705 -0.292692 -0.147370 -0.291069 -0.397128 -0.203452 -0.619005 0.522777 0.226441 -0.394693 -0.394199 0.324333 -0.224269 -0.210766 -0.247137 0.771858 -0.480015 0.488402 -0.332728 -0.300431 -0.409951 -0.355613 -0.094158 -0.085369 -0.122622 -0.223745 -0.227298 -0.241521 0.315496 0.236293 0.234019 0.343232 0.232057 0.232775 0.225979 0.226209 0.228788 0.222985 0.249767 0.232574 0.272909 0.227470 0.228042 0.229794
chargesum: 0.00000
title: Mulliken charges with hydrogens summed into heavy atoms:
elementType: Cl Cl Cl Cl Cl O O O O N C C C C C C C C C C C C C C C C C C C C C C C
charge: 0.068249 0.058218 0.066878 0.067281 0.073110 -0.310705 -0.292692 -0.147370 -0.291069 -0.053896 0.112044 -0.148693 0.522777 0.226441 -0.162636 -0.161424 0.324333 0.001710 0.015443 -0.018349 0.771858 -0.007263 0.488402 -0.332728 -0.300431 -0.177377 -0.082704 -0.094158 -0.085369 -0.122622 0.003724 0.000744 -0.011727
polarizability: 4.27257467e+02 1.96459103e+01 3.18208737e+02 -1.07083251e+01 1.20179830e+01 2.06615319e+02
1716.lowfreq: -19.4207 -5.3226 -2.4964 -0.0023 -0.0015 -0.0009 3.5481 7.9295 13.7460
frequency: -16.9165 5.9047 13.6386 19.9779 25.3307 26.8724 31.3937 39.8504 42.7859 50.7071 67.1233 72.7405 76.9243 82.3807 95.6603 111.9595 132.0448 147.6486 161.7573 188.2512 198.5300 200.5051 210.2436 213.7274 230.1958 248.0858 286.7653 297.2964 313.7686 318.2128 323.9878 329.1475 342.4418 349.7657 360.1425 385.5486 403.0453 403.9993 410.2583 431.2772 476.5176 503.9814 544.8795 554.2886 570.3706 592.2399 593.5986 602.2448 612.4406 616.2360 617.6856 642.3174 661.3378 670.8340 685.1276 693.5047 704.0735 706.6194 724.1050 752.5577 761.6906 774.7397 799.9615 814.2163 823.9007 829.1491 851.1019 857.6156 862.8396 873.8413 919.6394 931.4584 932.7996 964.7304 975.5257 982.9402 986.2254 990.3955 991.0931 994.8312 1002.4999 1005.0059 1025.9583 1027.3991 1061.0183 1083.8276 1091.5735 1101.1953 1130.1725 1172.3576 1173.6578 1177.6753 1189.9174 1190.5906 1217.2173 1220.5899 1224.6415 1229.7602 1240.5055 1275.1788 1317.3007 1320.4345 1328.6167 1330.8096 1333.0581 1338.1435 1353.6203 1355.9969 1384.5930 1384.7903 1440.9125 1442.6338 1461.8530 1463.9644 1482.6564 1483.7660 1487.5411 1535.7356 1544.1359 1593.2056 1594.8280 1614.3689 1614.8146 1656.6020 1700.2490 3000.0461 3032.5687 3057.0022 3073.3645 3108.1456 3115.9262 3119.1247 3122.3994 3126.1548 3133.5186 3138.6058 3147.3489 3149.3668 3163.1543 3163.7455 3567.6507
redmass: 5.6150 12.0170 8.6723 6.9695 4.3981 8.6070 11.0576 5.9980 4.6529 5.5645 31.6108 10.0681 11.4361 8.9115 6.6032 13.8602 6.3593 6.3775 6.6249 12.9370 29.5189 30.4827 19.6025 34.7318 5.4898 7.0055 5.9319 13.3652 8.3796 11.8298 13.8657 4.9466 3.6253 6.6604 17.0206 3.0567 2.8353 2.8390 3.4250 6.5187 3.9515 4.1601 4.8423 5.8408 1.2975 7.0985 11.1073 4.5588 13.0196 6.2744 6.2792 5.3895 10.4495 6.5084 8.5262 9.0513 1.7762 1.9095 11.2545 2.2547 2.0297 5.3666 11.8966 3.5210 12.3113 3.9189 1.2665 2.3960 1.6005 2.5878 1.6908 2.3054 2.4848 3.5289 1.3917 1.8103 1.7702 6.1910 4.9064 1.3386 1.4970 2.2280 2.2169 2.2012 11.9176 1.9739 1.5381 3.9965 2.9270 1.0543 1.0862 1.6496 1.1287 1.1240 2.5505 2.6853 1.9665 7.8981 1.1782 1.2324 1.2535 1.3930 11.9452 1.2527 1.2454 11.9606 1.3356 9.0721 7.5984 7.5293 2.1712 2.1732 1.1925 1.1423 2.0389 2.2555 1.8646 11.9855 11.9049 6.0337 6.0472 6.0192 6.1328 9.3056 12.1610 1.0596 1.0590 1.0976 1.0909 1.1066 1.0875 1.0860 1.0865 1.0875 1.0913 1.0922 1.0960 1.0964 1.1016 1.1015 1.0772
irintensity: 0.1485 0.0189 0.0329 0.0052 0.1043 0.2510 0.1590 0.5681 0.1466 0.1108 0.1265 8.9202 0.1053 0.9345 0.1875 0.6905 1.0138 0.3135 2.1192 0.3587 0.0348 0.1576 0.1882 0.0019 1.4829 8.5486 4.2284 1.2873 0.7574 0.0327 0.8368 1.0726 4.6381 3.4669 0.8392 9.7446 0.0947 0.1144 3.1511 15.4099 29.2149 10.3414 3.5404 5.6930 153.3812 7.0281 1.0657 2.4713 8.8115 0.4697 0.4060 26.2354 60.5040 11.7105 10.8619 22.7636 72.4199 44.2525 13.6019 74.6184 35.5568 164.6024 36.9083 11.7954 0.4763 29.7162 0.0649 22.6611 15.3392 60.3577 11.3811 148.1275 71.1174 108.1488 0.9040 26.7427 24.6722 0.4209 5.5676 6.9183 3.6430 28.4343 3.3163 7.9489 96.7165 49.4643 3.6983 160.6852 275.4326 0.1755 9.4575 146.8109 0.3025 0.7280 3.4597 44.8469 67.0991 19.2539 8.3328 13.8143 5.9922 51.9880 124.7629 3.6064 5.2007 29.2475 26.0133 265.0434 0.2527 0.3970 9.6563 6.9781 68.4388 80.0960 69.2485 26.8658 199.1904 0.9927 2.5960 1.6725 1.5843 0.5989 3.8147 238.8067 168.1703 25.6844 32.0190 6.0762 8.0660 6.7438 6.7613 4.6209 2.6078 3.0830 11.9301 18.7734 46.3828 20.5481 12.1180 30.8824 49.6422
temp: 298.150 k
press: 1.00000 atm
elementType: 17 17 17 17 17 8 8 8 8 7 6 6 6 6 6 6 6 6 6 6 6 6 6 6 6 6 6 6 6 6 6 6 6 1 1 1 1 1 1 1 1 1 1 1 1 1 1 1 1
symmnumber: 1
zpe: 883544.2 jmol-1
zpe.correction: 0.336524 hartree
zpe.thermalcorrener: 0.367401 hartree
zpe.thermalcorrenthalpy: 0.368345 hartree
zpe.thermalcorrgfe: 0.266800 hartree
zpe.sumelectzpe: -3539.638761 hartree
zpe.sumelectthermal: -3539.607885 hartree
zpe.sumelectthermalent: -3539.606941 hartree
zpe.sumelectthermalfe: -3539.708486 hartree
dipole: 1.5882 -0.0508 -2.8379
dipole: 3.2525
quadrupole: -212.0972 -215.1981 -229.0351
quadrupole: 2.6808 -6.2119 5.2470
quadrupole: 6.6796 3.5787 -10.2583 2.6808 -6.2119 5.2470
hfenergy: -3539.9752856 hartree
pointgroup: C01 [X(C23H16Cl5N1O4)]
dipole: 0.6122913 -0.4706774 -1.0202888 debye
polarizability: 429.0583996|7.5552946|309.7808747|-15.9028328|-28.6202304|213.2422495 unknown
InChI: InChI=1S/C23H16Cl5NO4/c24-16-17(25)19(27)21(20(28)18(16)26)33-22(30)15(11-13-7-3-1-4-8-13)29-23(31)32-12-14-9-5-2-6-10-14/h1-10,15,29H,11-12H2
charge 0 multiplicity 1
49 atoms
Cl -3.113393 -1.909504 1.546318
Cl -3.653338 2.445994 -1.789068
Cl -6.864892 2.043348 -1.844267
Cl -6.321269 -2.376457 1.502851
Cl -8.188654 -0.386143 -0.201676
O  -2.208925 0.370043 -0.151973
O  1.696041 -1.892078 0.852788
O  -2.237076 2.015434 1.534583
O  2.039254 0.09119 2.096093
N  0.423732 -0.074948 0.395682
C  -0.077918 1.29008 0.525248
C  0.24622 2.185665 -0.72768
C  1.736681 2.444948 -0.864778
C  -1.586298 1.30623 0.761422
C  2.332094 3.560445 -0.220975
C  2.564177 1.566655 -1.609048
C  1.440414 -0.553979 1.196985
C  3.721328 3.793525 -0.318279
C  3.955406 1.794037 -1.705801
C  4.538127 2.908973 -1.060961
C  -3.61034 0.236249 -0.122614
C  2.835604 -2.541099 1.586788
C  4.118529 -2.46479 0.787621
C  -4.191449 -0.826318 0.603824
C  -4.429331 1.11117 -0.869223
C  4.5917 -3.596872 0.077966
C  4.862619 -1.256414 0.739643
C  -5.829311 0.926865 -0.893793
C  -5.590231 -1.020244 0.582058
C  -6.410056 -0.142254 -0.168478
C  5.789345 -3.528178 -0.669333
C  6.055031 -1.18511 -0.012608
C  6.523396 -2.320365 -0.716454
H  0.398182 1.733508 1.416335
H  -0.157885 1.67901 -1.623399
H  -0.302171 3.139566 -0.611129
H  -0.009446 -0.709196 -0.277204
H  1.704664 4.250892 0.357072
H  2.119333 0.701351 -2.114765
H  4.165681 4.661411 0.181749
H  4.58097 1.101439 -2.279868
H  5.61615 3.090049 -1.139006
H  2.496493 -3.580556 1.718883
H  2.929503 -2.037015 2.564528
H  4.021052 -4.533432 0.110224
H  4.496412 -0.379064 1.285111
H  6.148742 -4.410577 -1.210541
H  6.62196 -0.247712 -0.043281
H  7.453342 -2.265368 -1.293872
