program: Gaussian 09
title: 000273955
version: EM64L-G09RevD.01
frameworkgroup: C1[X(C12H17NO2S)]
method: RPBEPBE
basis: SDD
operation: Freq
keyword: #p
keyword: freq=noraman
keyword: PBEPBE/SDD
title: #p freq=noraman PBEPBE/SDD
converged: YES YES NO NO
title: Mulliken charges:
elementType: S O O N C C C C C C C C C C C C H H H H H H H H H H H H H H H H H
charge: 0.965096 -0.542852 -0.542012 -0.250937 -0.448873 -0.445447 -0.380517 -0.380844 -0.380664 -0.748603 0.514992 -0.347173 -0.347016 -0.218593 -0.218392 -0.227105 0.260773 0.230091 0.229610 0.253587 0.242101 0.202345 0.201651 0.246025 0.183324 0.221268 0.275939 0.273483 0.241064 0.242642 0.231207 0.231208 0.232620
chargesum: 0.00000
title: Mulliken charges with hydrogens summed into heavy atoms:
elementType: S O O N C C C C C C C C C C C C
charge: 0.965096 -0.542852 -0.542012 -0.250937 0.041992 0.037750 0.063929 0.066831 0.023928 -0.199181 0.514992 -0.106109 -0.104374 0.012613 0.012817 0.005516
polarizability: 2.57252301e+02 1.04547913e-01 1.58240148e+02 -1.99054930e+01 7.60727875e-01 1.16036174e+02
1716.lowfreq: -17.0435 -0.0021 -0.0015 -0.0006 3.3430 8.3903 9.5552 27.2151 44.4186
frequency: -4.0542 26.5870 43.8402 47.1751 96.3577 117.4151 150.7374 186.8885 197.4698 220.6902 226.1782 285.1210 331.9845 339.2361 346.3253 385.8918 396.0495 401.6698 433.1248 457.4534 486.6540 527.6246 576.3253 602.3450 616.1936 693.7722 770.2381 772.5685 780.1602 802.5292 813.8639 843.9827 847.2727 851.3980 863.7342 874.3771 926.7972 927.7584 939.6064 978.0503 989.4617 999.7063 1005.7503 1026.9935 1035.4820 1056.9284 1078.2700 1102.0232 1120.2014 1129.2358 1145.2294 1176.0536 1189.4362 1190.6836 1199.6789 1233.7189 1243.7710 1271.8892 1288.7399 1325.0531 1330.4220 1335.0311 1338.0672 1351.8465 1367.9111 1388.7197 1420.9506 1429.5610 1432.1440 1443.2481 1460.7981 1467.8587 1472.4514 1485.1256 1590.2105 1611.9012 2964.5057 2968.9081 2973.9296 2990.6732 2991.3184 3038.1923 3050.4491 3056.5614 3063.5246 3066.8630 3069.1406 3128.8143 3134.5201 3144.1623 3155.5926 3158.0022 3169.3263
redmass: 4.6232 4.1533 4.5951 4.9642 4.1231 6.0496 3.1485 5.6309 9.1206 3.4820 4.0350 2.8474 4.5742 2.2344 2.2501 2.1012 5.4750 2.7656 4.8423 3.1817 3.2485 4.1364 4.2011 2.4857 6.2984 1.6981 2.0862 4.2036 1.5247 11.2243 4.1907 1.8557 1.2608 2.0075 2.3197 2.7774 1.3824 1.4462 3.3680 1.3979 5.6746 1.3582 2.4179 2.1917 2.0631 1.9500 1.4994 1.9999 1.1383 2.1812 1.4298 1.0536 1.5142 1.1271 1.1392 2.9323 1.2821 1.1645 1.1996 1.2223 1.2754 1.4285 1.3628 1.4571 1.2901 8.9347 1.1660 1.0804 1.0774 2.2257 1.0826 1.0829 1.0910 2.3425 5.9733 6.0066 1.0650 1.0657 1.0667 1.0624 1.0603 1.0958 1.1003 1.0989 1.0976 1.1000 1.0578 1.0850 1.0882 1.0927 1.0979 1.1101 1.1018
irintensity: 1.7415 0.4907 1.1534 1.4381 3.1937 2.4594 0.8912 14.0554 0.0928 3.6649 12.6811 0.0765 25.4974 0.5926 0.0688 6.2073 35.1627 0.0286 7.6293 0.2386 57.6148 7.6573 12.7250 78.8186 0.0020 51.9171 12.0636 37.8862 0.3673 57.8168 12.1152 56.5080 0.1507 0.0220 21.3221 1.3621 6.8415 1.7188 40.2138 0.0990 0.5815 0.0416 5.4164 4.5375 5.0807 6.4645 16.9180 0.6701 0.4417 16.0906 0.8999 0.0013 8.1504 11.3858 11.8115 24.2053 21.5029 6.9448 23.6686 1.0047 0.5213 15.9426 0.7270 0.8373 8.3140 1.2711 4.1419 23.9979 10.0797 11.8010 11.4547 17.9946 14.2604 5.4709 0.7058 3.1131 47.9271 6.1948 40.8420 13.8900 43.1198 56.5673 38.1189 34.9124 4.4165 24.4007 7.1092 1.2039 0.2692 17.5249 24.8295 3.3971 21.5381
temp: 298.150 k
press: 1.00000 atm
elementType: 16 8 8 7 6 6 6 6 6 6 6 6 6 6 6 6 1 1 1 1 1 1 1 1 1 1 1 1 1 1 1 1 1
symmnumber: 1
zpe: 706062.8 jmol-1
zpe.correction: 0.268925 hartree
zpe.thermalcorrener: 0.284170 hartree
zpe.thermalcorrenthalpy: 0.285114 hartree
zpe.thermalcorrgfe: 0.225556 hartree
zpe.sumelectzpe: -1069.352576 hartree
zpe.sumelectthermal: -1069.337332 hartree
zpe.sumelectthermalent: -1069.336388 hartree
zpe.sumelectthermalfe: -1069.395945 hartree
dipole: -0.3673 -0.0538 3.3583
dipole: 3.3787
quadrupole: -81.7578 -101.0163 -108.5963
quadrupole: -0.0642 -3.9501 0.0626
quadrupole: 15.3657 -3.8928 -11.4728 -0.0642 -3.9501 0.0626
hfenergy: -1069.6215014 hartree
pointgroup: C01 [X(C12H17N1O2S1)]
dipole: -0.071748 0.0334658 1.3269383 debye
polarizability: 254.6276208|-1.997231|158.2676643|-27.4805695|-0.5621585|118.633338 unknown
InChI: InChI=1S/C12H17NO2S/c14-16(15,13-9-5-2-6-10-13)11-12-7-3-1-4-8-12/h1,3-4,7-8H,2,5-6,9-11H2
charge 0 multiplicity 1
33 atoms
S  -0.585719 0.023112 -0.004763
O  -0.499512 1.411876 -0.863744
O  -0.57634 -1.430464 -0.756852
N  -2.083661 0.126748 1.231187
C  -2.880138 1.366679 0.959403
C  -2.883485 -1.139075 1.17011
C  -3.854362 1.277587 -0.237878
C  -3.85471 -1.250131 -0.027664
C  -4.738155 0.0131 -0.143064
C  0.90075 0.027315 1.33895
C  2.217056 -0.008442 0.651613
C  2.873506 1.201302 0.296377
C  2.823308 -1.251256 0.321926
C  4.122379 1.167993 -0.357888
C  4.071746 -1.282185 -0.333341
C  4.725509 -0.073325 -0.671078
H  -2.1729 2.202814 0.820839
H  -3.440741 1.547606 1.900395
H  -3.446966 -1.157758 2.126517
H  -2.180964 -1.99064 1.176858
H  -3.266416 1.263705 -1.175486
H  -4.478339 2.191919 -0.258011
H  -4.47895 -2.155204 0.102185
H  -3.262738 -1.390216 -0.951995
H  -5.39916 0.08702 0.746404
H  -5.397942 -0.059976 -1.027516
H  0.670356 0.951782 1.887389
H  0.640969 -0.86694 1.923637
H  2.397052 2.161298 0.525184
H  2.307838 -2.186092 0.569588
H  4.622615 2.104032 -0.628526
H  4.532644 -2.243265 -0.585497
H  5.69557 -0.09852 -1.179962
