program: Gaussian 09
title: 000273922
version: EM64L-G09RevD.01
frameworkgroup: C1[X(C20H18O4)]
method: RPBEPBE
basis: SDD
operation: Freq
keyword: #pfreq=noraman
keyword: PBEPBE/SDD
title: #p freq=noraman PBEPBE/SDD
converged: YES YES NO NO
title: Mulliken charges:
elementType: O O O O C C C C C C C C C C C C C C C C C C C C H H H H H H H H H H H H H H H H H H
charge: -0.266934 -0.266943 -0.245558 -0.245552 0.109269 0.109342 0.280088 0.280051 0.187208 0.187208 -0.764671 -0.764678 -0.408872 -0.408878 -0.385759 -0.385762 -0.282546 -0.282544 -0.266673 -0.266670 0.289658 0.289648 -0.506212 -0.506214 0.263664 0.317884 0.263677 0.317897 0.270580 0.270600 0.227382 0.227382 0.229060 0.229060 0.229371 0.229371 0.246207 0.243530 0.233298 0.233297 0.246205 0.243530
chargesum: 0.00000
title: Mulliken charges with hydrogens summed into heavy atoms:
elementType: O O O O C C C C C C C C C C C C C C C C C C C C
charge: -0.266934 -0.266943 -0.245558 -0.245552 0.109269 0.109342 0.280088 0.280051 0.187208 0.187208 -0.183123 -0.183103 -0.138291 -0.138278 -0.158377 -0.158380 -0.053486 -0.053484 -0.037302 -0.037299 0.289658 0.289648 0.216823 0.216818
polarizability: 3.26411821e+02 -7.49136265e-03 2.58157638e+02 4.23555891e+01 -1.10086712e-02 1.36596591e+02
1716.lowfreq: -7.2208 -3.6702 -0.0011 -0.0003 0.0006 4.7573 20.8314 23.8524 40.1444
frequency: 20.7578 23.8499 40.1308 48.1049 51.3607 67.6479 87.5580 88.5869 96.5418 98.9269 139.2823 154.8111 185.4134 193.8717 206.3609 225.9622 260.9564 273.6737 304.9255 311.1850 344.8280 400.7402 405.3371 432.8083 438.8602 453.6210 455.8901 499.2414 533.0922 558.9003 566.0416 578.7180 589.9433 614.6562 633.6820 635.3694 674.5904 723.3945 730.6705 741.5896 769.2494 769.6344 777.7381 813.1081 813.5039 820.1990 841.0957 876.0802 907.4070 926.6971 945.4853 954.6273 960.9534 970.2331 988.3511 989.2489 992.9666 999.6035 1002.5117 1049.0980 1059.3552 1079.0026 1104.8942 1112.9706 1112.9833 1117.6850 1125.7890 1148.7726 1149.0990 1164.8401 1187.1593 1189.7547 1225.1524 1245.2950 1258.3594 1273.7991 1288.8949 1308.1455 1310.3520 1324.5283 1363.9047 1392.0183 1400.7121 1421.0068 1421.1601 1439.3051 1442.2302 1450.2857 1452.2878 1452.3109 1463.2173 1463.2662 1480.9052 1502.9291 1519.9728 1536.7432 1579.1651 1596.4572 1616.8280 1619.8878 1627.8052 1636.1437 3007.1020 3007.2150 3029.0436 3029.6402 3102.6328 3103.4128 3110.6500 3110.6816 3127.9345 3129.6900 3142.4413 3147.4335 3151.8878 3151.9010 3158.3791 3165.3458 3171.3826 3173.3923
redmass: 5.4718 4.6916 5.0515 4.4360 5.3862 4.1720 1.2638 1.2012 3.4900 3.0969 4.0427 4.7058 4.8613 4.8566 5.2493 5.1378 4.6294 4.5822 4.1561 4.7183 5.2516 3.4157 5.8952 4.2592 3.3703 3.9067 3.4785 2.4898 4.2835 5.0493 3.2825 3.3895 4.6542 6.8756 4.6894 4.9274 5.2537 5.1113 3.9281 2.1337 1.8324 2.1208 3.3974 3.7220 1.8426 5.0725 3.5671 1.4634 2.9737 3.6105 4.5794 1.4355 1.3945 4.5006 1.3576 2.9968 1.7775 3.0754 3.2801 2.1454 2.2611 3.5018 2.3675 1.2697 1.2706 2.2857 2.2531 1.4342 1.4444 1.3345 1.1611 1.1090 1.8176 1.6372 1.5112 2.6567 1.4808 1.5181 1.4951 2.4568 3.3935 5.6769 5.0035 1.1863 1.1840 2.3103 2.7097 3.3732 1.0501 1.0509 1.0508 1.0506 1.3789 1.8035 1.2535 2.4757 7.5995 7.6449 5.7665 6.0967 8.8557 8.8015 1.0293 1.0293 1.0643 1.0642 1.0970 1.0969 1.1047 1.1047 1.0851 1.0856 1.0901 1.0901 1.1050 1.1050 1.0959 1.0924 1.0980 1.0978
irintensity: 1.8619 1.2705 1.3100 0.0113 0.4302 1.3176 0.3863 0.1534 0.8655 0.1365 0.5371 0.6730 1.8237 15.5733 0.0199 10.0210 0.4427 0.5200 35.1324 1.9903 1.9213 0.4373 3.0029 3.1347 5.9297 4.1181 8.6471 0.1766 11.7674 0.4667 1.3810 1.9924 0.9218 5.2586 1.3300 7.2951 0.1882 9.1298 4.9665 58.6065 118.7024 0.5155 0.5936 10.0684 0.0926 19.8826 0.8638 0.3312 0.0591 1.0749 35.4025 0.0017 3.7077 17.2895 0.0129 0.3232 2.3040 55.6587 10.3374 52.0339 0.8904 1.6476 2.2589 0.1254 1.1623 392.1236 35.6863 13.4803 2.8459 1.8831 3.0235 0.8271 21.3810 170.5902 8.3531 22.1499 27.5418 48.0404 38.8865 10.6046 1.9943 0.4723 3.1636 7.9128 31.3393 13.7777 10.0954 0.4142 5.1096 25.2170 22.8616 0.1059 23.0208 30.6690 18.8298 0.4613 1.3734 12.4425 2.2589 1.2328 56.1060 218.4977 58.5014 14.1876 32.5941 0.7352 10.0941 0.1568 8.0898 40.0594 0.1308 3.9474 26.8910 2.7905 28.1153 0.7995 3.7052 31.4780 34.4583 18.7685
temp: 298.150 k
press: 1.00000 atm
elementType: 8 8 8 8 6 6 6 6 6 6 6 6 6 6 6 6 6 6 6 6 6 6 6 6 1 1 1 1 1 1 1 1 1 1 1 1 1 1 1 1 1 1
symmnumber: 1
zpe: 865768.6 jmol-1
zpe.correction: 0.329754 hartree
zpe.thermalcorrener: 0.351589 hartree
zpe.thermalcorrenthalpy: 0.352533 hartree
zpe.thermalcorrgfe: 0.276286 hartree
zpe.sumelectzpe: -1072.150888 hartree
zpe.sumelectthermal: -1072.129054 hartree
zpe.sumelectthermalent: -1072.128109 hartree
zpe.sumelectthermalfe: -1072.204356 hartree
dipole: 0.0005 0.4561 -0.0006
dipole: 0.4561
quadrupole: -106.2132 -126.8995 -147.4167
quadrupole: -0.0042 -1.4702 0.0003
quadrupole: 20.6300 -0.0564 -20.5735 -0.0042 -1.4702 0.0003
hfenergy: -1072.4806423 hartree
pointgroup: C01 [X(C20H18O4)]
dipole: -0.1794434 0.0001227 -0.0003025 debye
polarizability: 258.1576183|-0.0253927|330.3358234|0.0515948|32.152171|132.6726086 unknown
InChI: InChI=1S/C20H18O4/c1-23-19(21)11-17-15-9-5-3-7-13(15)14-8-4-6-10-16(14)18(17)12-20(22)24-2/h3-10H,11-12H2,1-2H3
charge 0 multiplicity 1
42 atoms
O  2.474876 3.505199 -0.350878
O  2.475435 -3.50479 0.352471
O  2.940185 1.622436 -1.635894
O  2.938947 -1.62222 1.638419
C  0.55539 0.658942 0.229263
C  0.55572 -0.658755 -0.228789
C  -0.701015 1.381347 0.406172
C  -0.700389 -1.381396 -0.406839
C  -1.957603 0.706865 0.187863
C  -1.9573 -0.707151 -0.189677
C  1.871338 1.361945 0.58271
C  1.872106 -1.361486 -0.581127
C  -0.717037 2.770147 0.760278
C  -0.715826 -2.770203 -0.760947
C  -3.168256 1.447715 0.354583
C  -3.167663 -1.448229 -0.357504
C  -1.9195 3.469425 0.914902
C  -1.918014 -3.469711 -0.916662
C  -3.158271 2.800382 0.715109
C  -3.157092 -2.800897 -0.718013
C  2.477737 2.128436 -0.585893
C  2.477528 -2.128096 0.587907
C  3.043715 4.345284 -1.435919
C  3.043597 -4.344978 1.437786
H  1.725777 2.051818 1.426595
H  2.606592 0.609376 0.915844
H  1.727448 -2.051239 -1.425263
H  2.607552 -0.608749 -0.913462
H  0.225668 3.308851 0.886986
H  0.227094 -3.308733 -0.886782
H  -4.132838 0.958676 0.192499
H  -4.132487 -0.959374 -0.196313
H  -1.905733 4.531614 1.182494
H  -1.903804 -4.531901 -1.184228
H  -4.10218 3.343224 0.835148
H  -4.100789 -3.343916 -0.838916
H  2.471071 4.199462 -2.366833
H  4.098199 4.074751 -1.611837
H  2.953024 5.376951 -1.068947
H  2.953602 -5.376574 1.070441
H  2.470066 -4.199621 2.368226
H  4.097827 -4.074123 1.614728
