program: Gaussian 09
title: 000273906
version: EM64L-G09RevD.01
frameworkgroup: C1[X(C17H12O)]
method: RPBEPBE
basis: SDD
operation: Freq
keyword: #pfreq=noraman
keyword: PBEPBE/SDD
title: #p freq=noraman PBEPBE/SDD
converged: YES YES NO YES
title: Mulliken charges:
elementType: O C C C C C C C C C C C C C C C C C H H H H H H H H H H H H
charge: -0.174513 0.008654 0.008655 -0.626960 -0.626960 0.274938 0.274936 0.216191 0.216191 0.122550 -0.402162 -0.402161 -0.387680 -0.387680 -0.263693 -0.263693 -0.264358 -0.264359 0.263148 0.263041 0.263041 0.263148 0.251288 0.251289 0.230917 0.230917 0.232442 0.232442 0.230215 0.230215
chargesum: 0.00000
title: Mulliken charges with hydrogens summed into heavy atoms:
elementType: O C C C C C C C C C C C C C C C C C
charge: -0.174513 0.008654 0.008655 -0.100771 -0.100771 0.274938 0.274936 0.216191 0.216191 0.122550 -0.150874 -0.150872 -0.156763 -0.156763 -0.031251 -0.031251 -0.034143 -0.034143
polarizability: 2.25538689e+02 6.41267401e-05 2.69856495e+02 -1.59792182e-03 5.09522986e-03 7.68615963e+01
1716.lowfreq: -2.1496 -0.0005 -0.0005 0.0005 5.9634 6.8961 59.8211 87.8968 101.3632
frequency: 59.8209 87.8963 101.3630 145.6519 166.0340 179.4546 232.2138 270.3041 312.4294 377.9663 405.4458 407.3563 426.1173 436.0980 461.7956 462.3630 534.7541 559.0720 596.3620 613.3982 616.0119 617.4712 648.5037 696.6770 738.7200 766.2735 768.8448 773.5824 793.6467 814.2909 841.0459 875.5919 887.7871 946.4735 956.1707 957.2551 971.2430 989.3722 990.2307 993.0614 995.4143 1041.9754 1047.6479 1079.5056 1110.3502 1112.8358 1138.1478 1160.0833 1171.1530 1180.5733 1181.2948 1232.2444 1235.5812 1252.3985 1295.3869 1297.3267 1338.8955 1381.0211 1393.3263 1412.7767 1419.3785 1423.3120 1441.6334 1445.1860 1451.5084 1511.6767 1531.9839 1578.4867 1602.1239 1620.2429 1623.8582 1671.0427 2976.3586 2980.5983 3022.6183 3023.0889 3126.2164 3127.1440 3136.1220 3138.4408 3150.0762 3155.5434 3165.2386 3169.7580
redmass: 6.0204 3.3480 4.2270 3.2020 2.5670 6.7576 4.8767 3.7150 3.4064 7.5045 6.6510 6.8996 2.8666 3.1319 5.3606 2.2409 3.4902 2.8124 3.8698 6.9415 7.5987 2.7141 6.7502 5.1805 2.5192 1.4331 1.5046 5.4742 3.4789 1.6757 1.5627 1.4024 7.3002 2.7959 1.5105 1.4796 1.9726 7.4893 1.3777 1.3313 4.3757 1.9706 2.2843 3.0058 2.2230 1.2418 4.1122 1.2446 1.5422 1.1469 1.1110 1.5517 1.6021 1.6347 2.5605 1.6009 2.6427 4.3080 7.6300 2.0387 1.1833 1.4411 2.5336 2.6637 2.9616 4.0182 3.7174 7.6326 6.9328 6.5779 6.5879 12.5342 1.0602 1.0613 1.0994 1.0975 1.0848 1.0851 1.0888 1.0897 1.0949 1.0943 1.1007 1.0975
irintensity: 4.4736 0.0000 0.0352 14.6529 0.0000 0.2158 0.2208 0.0000 2.0543 0.7132 1.1315 1.8746 0.0000 5.1998 4.3681 0.1814 2.6190 0.0000 3.0617 3.1348 4.9968 0.0000 1.3372 0.0682 42.9918 0.0000 145.3592 1.3933 1.9401 0.0000 0.0000 0.5989 1.7782 0.0000 0.0000 2.9818 0.0036 2.2552 0.0000 0.0386 1.0890 16.9742 2.4575 0.0468 1.9747 0.0000 52.8528 1.1286 3.3412 0.0075 0.0205 6.6976 0.7448 7.9799 5.8327 0.0057 17.1197 15.1451 5.4246 9.9529 0.4997 10.9759 3.4030 9.8461 1.3465 13.3065 0.8028 0.1030 1.0388 0.4590 2.2487 277.8887 9.9899 28.3828 8.6761 0.0003 0.0809 1.2457 1.4385 20.5309 24.1994 11.7473 44.1582 31.9731
temp: 298.150 k
press: 1.00000 atm
elementType: 8 6 6 6 6 6 6 6 6 6 6 6 6 6 6 6 6 6 1 1 1 1 1 1 1 1 1 1 1 1
symmnumber: 1
zpe: 616242.6 jmol-1
zpe.correction: 0.234714 hartree
zpe.thermalcorrener: 0.247753 hartree
zpe.thermalcorrenthalpy: 0.248698 hartree
zpe.thermalcorrgfe: 0.195215 hartree
zpe.sumelectzpe: -729.055929 hartree
zpe.sumelectthermal: -729.042890 hartree
zpe.sumelectthermalent: -729.041946 hartree
zpe.sumelectthermalfe: -729.095429 hartree
dipole: -3.1520 0.0000 -0.0006
dipole: 3.1520
quadrupole: -113.8815 -87.3722 -108.3201
quadrupole: 0.0000 -0.0057 0.0006
quadrupole: -10.6902 15.8191 -5.1288 0.0000 -0.0057 0.0006
hfenergy: -729.2906439 hartree
pointgroup: C01 [X(C17H12O1)]
dipole: 1.2400951 0.0000563 0.0002422 debye
polarizability: 225.5386893|-0.0020241|269.856495|-0.0015977|-0.0050953|76.8615963 unknown
InChI: InChI=1S/C17H12O/c18-11-9-16-14-7-3-1-5-12(14)13-6-2-4-8-15(13)17(16)10-11/h1-8H,9-10H2
charge 0 multiplicity 1
30 atoms
O  -4.706639 -0.000216 -0.000448
C  -1.153428 -0.694899 0.000151
C  -1.15349 0.694782 0.000113
C  -2.559803 -1.257296 0.000123
C  -2.559914 1.257055 0.000055
C  0.077577 -1.448598 0.000047
C  0.077447 1.448593 -0.00003
C  1.333627 -0.734378 -0.000046
C  1.333561 0.734487 -0.000084
C  -3.455263 -0.00016 0.000727
C  0.07375 -2.878014 0.000046
C  0.07349 2.878009 -0.000107
C  2.537794 -1.50317 -0.000135
C  2.537659 1.503388 -0.000211
C  1.271965 -3.601634 -0.000039
C  1.27164 3.601737 -0.000229
C  2.51328 -2.904862 -0.00013
C  2.513018 2.905078 -0.00028
H  -2.793953 -1.881074 -0.885649
H  -2.79377 -1.881624 0.885552
H  -2.793938 1.881411 0.88545
H  -2.794118 1.880764 -0.885752
H  -0.885243 -3.407647 0.000119
H  -0.88555 3.407555 -0.000064
H  3.508458 -0.998905 -0.000215
H  3.50837 0.999212 -0.000261
H  1.258594 -4.696884 -0.000037
H  1.258169 4.696986 -0.000285
H  3.453511 -3.467043 -0.0002
H  3.453198 3.467344 -0.000378
