program: Gaussian 09
title: 000273910
version: EM64L-G09RevD.01
frameworkgroup: C1[X(C18H15NO2)]
method: RPBEPBE
basis: SDD
operation: Freq
keyword: #p
keyword: freq=noraman
keyword: PBEPBE/SDD
title: #p freq=noraman PBEPBE/SDD
converged: YES YES NO NO
title: Mulliken charges:
elementType: O O N C C C C C C C C C C C C C C C C C C H H H H H H H H H H H H H H H
charge: -0.262823 -0.217360 -0.042047 0.325967 0.224876 -0.134071 0.030492 -0.394830 -0.484376 0.348410 -0.331687 0.295490 0.099835 -0.354531 -0.371174 -0.372903 -0.784293 -0.231106 -0.248565 -0.239542 -0.536200 0.261485 0.263680 0.265188 0.250028 0.277711 0.226260 0.262408 0.250688 0.241820 0.225985 0.227094 0.229194 0.249538 0.224091 0.225268
chargesum: 0.00000
title: Mulliken charges with hydrogens summed into heavy atoms:
elementType: O O N C C C C C C C C C C C C C C C C C C
charge: -0.262823 -0.217360 -0.042047 0.325967 0.224876 -0.134071 0.030492 -0.133345 -0.220696 0.348410 -0.066499 0.295490 0.099835 -0.104503 -0.093463 -0.146643 -0.029376 -0.005121 -0.021471 -0.010348 0.162697
polarizability: 3.97546928e+02 1.72531266e+01 2.35038879e+02 -2.30729661e+00 -8.20401233e+00 9.29153369e+01
1716.lowfreq: -6.7772 -0.0006 0.0003 0.0009 1.3618 4.3106 17.4328 39.8802 45.8706
frequency: 17.1145 39.8660 45.8637 78.4919 88.6219 91.6985 137.4619 153.6582 188.8146 204.4679 223.7483 231.0652 247.2968 252.8772 293.7117 309.4716 372.0606 393.7072 401.3621 412.4606 434.1256 483.8425 487.7508 509.7998 547.6401 560.2477 581.1496 604.1354 616.3496 645.9821 666.4864 688.9832 697.2873 699.7177 774.3541 782.2419 788.8346 830.2916 832.7303 854.1511 874.1088 891.3545 924.5155 937.6229 967.4338 970.6400 985.8507 987.1953 989.4114 1004.7020 1006.9103 1019.6686 1025.0612 1064.9662 1086.3075 1111.3136 1128.3283 1140.3460 1167.2799 1171.6639 1191.7550 1200.1502 1239.6712 1262.0742 1292.2697 1310.4646 1324.0703 1341.6138 1371.6833 1375.6445 1383.1714 1402.7566 1434.1738 1441.6798 1451.6717 1458.2847 1460.8430 1469.7281 1472.7237 1489.9985 1500.6321 1532.0456 1555.0701 1586.5349 1594.9409 1611.1266 1629.6443 2965.4889 2986.2648 3056.5908 3079.3561 3118.9325 3125.4181 3129.3790 3135.1290 3148.4551 3154.7914 3160.8442 3170.8393 3175.4867 3175.9637 3196.8199
redmass: 3.7183 4.8993 4.3332 3.4027 4.8086 4.9704 4.5565 4.7975 3.2384 1.8143 1.1895 3.6984 3.1890 2.5429 5.4361 3.5704 5.4787 5.9708 2.8320 4.4125 4.5996 3.3699 4.3554 5.7140 4.4588 4.0640 3.3531 4.6036 6.4317 6.0697 4.3682 3.0390 2.0776 4.0327 2.6102 4.3051 1.9837 1.8460 6.9943 1.2708 1.7401 6.5594 1.5552 1.4677 1.3479 2.9719 2.0157 1.8363 4.1438 3.6149 1.3423 1.9452 2.2505 2.3256 1.6801 1.2560 2.0806 1.5568 1.3726 1.0584 1.1784 2.3962 2.3259 1.6692 2.7149 4.0249 1.6838 3.9748 1.7408 1.8069 6.7724 6.2261 1.3450 2.3441 1.1027 1.9524 1.2052 1.0531 1.0838 2.7324 3.8813 6.4635 7.1197 6.3548 7.7313 6.0556 6.8173 1.0328 1.0388 1.1043 1.0929 1.1022 1.0847 1.0997 1.0884 1.0934 1.0872 1.0967 1.0979 1.0915 1.0961 1.0903
irintensity: 0.0218 2.7381 2.6111 3.8416 0.2685 2.2119 1.8326 3.3762 4.7904 0.9217 1.1170 6.4052 1.1382 1.5969 0.3663 4.9961 0.2412 2.1363 0.0912 2.6755 0.9671 0.3432 5.0209 6.7173 14.6015 39.1075 8.3899 5.4619 0.0262 0.4105 9.4902 1.8838 40.4164 19.6482 4.5948 5.2426 46.2672 41.3853 2.7970 1.3727 20.5167 4.6300 20.5342 3.4250 1.4455 11.8676 4.5812 4.4807 0.1816 67.3970 1.2977 4.8361 16.7677 7.1455 14.1181 0.1610 53.0501 21.2414 14.6592 0.4162 19.9665 253.4223 58.4116 106.8037 12.9364 87.9611 4.2649 180.9132 41.9248 20.6259 2.6793 2.8939 9.9471 16.6262 41.3524 6.4485 15.8323 15.3899 61.3703 40.1228 41.4753 128.8484 92.8047 2.3018 49.2113 10.3421 140.3789 94.8357 1.4022 43.6281 10.5494 11.8824 2.1075 24.3012 8.2547 34.0589 3.6038 22.8447 19.5309 9.3569 8.9875 7.0439
temp: 298.150 k
press: 1.00000 atm
elementType: 8 8 7 6 6 6 6 6 6 6 6 6 6 6 6 6 6 6 6 6 6 1 1 1 1 1 1 1 1 1 1 1 1 1 1 1
symmnumber: 1
zpe: 735038.2 jmol-1
zpe.correction: 0.279961 hartree
zpe.thermalcorrener: 0.298022 hartree
zpe.thermalcorrenthalpy: 0.298966 hartree
zpe.thermalcorrgfe: 0.232432 hartree
zpe.sumelectzpe: -898.651366 hartree
zpe.sumelectthermal: -898.633306 hartree
zpe.sumelectthermalent: -898.632362 hartree
zpe.sumelectthermalfe: -898.698895 hartree
dipole: -3.4620 -2.9024 1.1128
dipole: 4.6527
quadrupole: -90.4798 -119.2176 -127.4264
quadrupole: 8.3489 -0.5138 3.5568
quadrupole: 21.8948 -6.8430 -15.0519 8.3489 -0.5138 3.5568
hfenergy: -898.9313276 hartree
pointgroup: C01 [X(C18H15N1O2)]
dipole: 1.3328846 -1.0523479 -0.6832178 debye
polarizability: 396.5510674|-15.6602992|228.1009796|-17.3149813|32.5364485|100.8490976 unknown
InChI: InChI=1S/C18H15NO2/c1-12(20)15-11-18(13-6-4-3-5-7-13)19-17-9-8-14(21-2)10-16(15)17/h3-11H,1-2H3
charge 0 multiplicity 1
36 atoms
O  4.911831 -0.622143 -0.203295
O  0.144225 3.667319 1.054638
N  -0.679296 -1.134962 -0.310841
C  1.340513 0.322509 -0.055569
C  0.458641 1.447418 0.190303
C  0.688795 -0.955289 -0.316908
C  -1.482221 -0.078514 -0.024641
C  -0.923663 1.219378 0.22409
C  2.763434 0.360357 -0.019677
C  -2.953746 -0.323241 -0.001916
C  1.494888 -2.108678 -0.578097
C  3.523127 -0.793174 -0.269547
C  0.882518 2.888518 0.382097
C  2.887112 -2.042906 -0.562609
C  -3.459414 -1.580261 -0.435918
C  -3.877517 0.659543 0.449638
C  2.13407 3.438792 -0.294773
C  -4.843222 -1.843436 -0.426339
C  -5.263519 0.394034 0.460835
C  -5.754504 -0.856647 0.021183
C  5.766114 -1.790907 -0.439401
H  -1.567642 2.079499 0.42256
H  3.308769 1.273055 0.223408
H  0.970639 -3.047984 -0.777084
H  3.477601 -2.941876 -0.760651
H  -2.740709 -2.332577 -0.773648
H  -3.527217 1.632369 0.809729
H  1.946377 4.49449 -0.55111
H  2.420376 2.874197 -1.196625
H  2.987136 3.424985 0.41104
H  -5.21426 -2.816466 -0.767623
H  -5.959318 1.162249 0.816096
H  -6.831103 -1.060466 0.029397
H  6.794225 -1.415845 -0.332851
H  5.622015 -2.196312 -1.459265
H  5.580041 -2.584228 0.30967
