program: Gaussian 09
title: 000026457
version: EM64L-G09RevD.01
frameworkgroup: C1[X(C19H25ClN5O2)]
method: RPBEPBE
basis: SDD
operation: Freq
keyword: #p
keyword: freq=noraman
keyword: PBEPBE/SDD
title: #p freq=noraman PBEPBE/SDD
converged: YES YES NO NO
title: Mulliken charges:
elementType: Cl O O N N N N N C C C C C C C C C C C C C C C C C C C H H H H H H H H H H H H H H H H H H H H H H H H H
charge: 0.008130 -0.193280 -0.190485 -0.105725 -0.161948 -0.099452 -0.084529 0.023708 -0.365945 -0.497584 -0.552757 -0.542209 -0.555095 -0.391294 0.476600 -0.642066 -0.343590 -0.339545 -0.381481 -0.302368 0.153560 0.288422 -0.260191 -0.240741 0.415068 -0.361111 -0.357586 0.273418 0.315635 0.251561 0.269292 0.274271 0.268679 0.267160 0.270436 0.266494 0.274564 0.272086 0.276306 0.266427 0.244520 0.209964 0.251738 0.213601 0.240357 0.204903 0.243198 0.256125 0.296424 0.284843 0.317659 0.293833
chargesum: 1.00000
title: Mulliken charges with hydrogens summed into heavy atoms:
elementType: Cl O O N N N N N C C C C C C C C C C C C C C C C C C C
charge: 0.008130 -0.193280 -0.190485 -0.105725 -0.161948 -0.099452 -0.084529 0.023708 0.223109 0.023268 0.257353 0.269286 0.259724 0.063189 0.476600 0.063630 -0.138687 -0.096347 -0.125355 -0.005945 0.153560 0.288422 -0.260191 0.044103 0.415068 -0.043452 -0.063753
polarizability: 6.69987707e+02 -4.55143237e+01 2.70733873e+02 1.24499275e+01 2.52690127e+01 1.44899246e+02
1716.lowfreq: 0.0010 0.0017 0.0022 2.3277 5.1708 8.0982 11.6221 19.7701 26.6280
frequency: 11.4726 19.6438 26.4225 33.9610 38.0351 50.4866 58.4122 61.6033 76.6422 95.1260 104.7165 135.7417 151.8098 163.7199 165.8781 175.5016 177.0815 196.8118 202.2150 218.9481 235.4003 251.8278 278.5830 284.4050 315.3491 329.2171 342.3296 345.6677 360.2301 372.1703 389.3831 407.4328 427.5498 433.3699 439.9785 462.2326 464.0524 469.5691 504.8052 518.0728 537.8520 550.2727 556.8007 576.5465 633.3057 638.1855 685.7640 692.0596 716.4393 732.9362 738.9843 754.4750 783.5746 788.1023 794.2688 797.3364 836.0134 849.8915 859.2498 867.6128 894.1121 899.2663 925.3104 929.4972 938.0683 954.6693 990.2574 993.8807 1000.7516 1005.6915 1026.6186 1026.9619 1044.4883 1049.8774 1078.6213 1097.4802 1100.4917 1110.2495 1118.3592 1128.7829 1145.8023 1155.4935 1181.7234 1192.2978 1203.8532 1211.9419 1219.6005 1237.5856 1247.0305 1257.8527 1260.6123 1283.9828 1310.8972 1324.0664 1333.4405 1335.3132 1344.3514 1365.0807 1372.2227 1379.9597 1391.6124 1396.7087 1397.2553 1407.3292 1421.4646 1425.1185 1441.6113 1444.1752 1448.7303 1453.5044 1461.8992 1464.4074 1468.9323 1469.6075 1479.4859 1483.9761 1486.3436 1492.3815 1497.6563 1500.6000 1512.9771 1558.5775 1573.2318 1589.8384 1618.7533 2991.5408 2992.6814 3002.5511 3023.5365 3026.0676 3028.8619 3032.3194 3053.5013 3066.1333 3089.2360 3103.0910 3108.4052 3135.5560 3140.0957 3140.4032 3144.9362 3146.1178 3150.4023 3153.2433 3157.8610 3162.5922 3166.2227 3176.8035 3188.0170 3190.5385
redmass: 7.0716 5.3242 4.2602 3.2413 5.8728 7.3105 5.5985 3.7370 3.3069 3.7748 2.1527 5.3180 5.0548 5.1917 5.3327 2.5953 3.8418 2.3318 4.1558 1.2873 2.7189 1.1680 1.6416 1.5213 6.3515 7.4533 2.4004 2.5248 4.6129 4.9432 6.2748 3.5995 2.7860 2.9350 2.8275 3.5411 3.4639 2.9599 5.5507 3.4321 3.9293 4.2677 3.2137 4.7002 7.0869 6.9834 6.3410 5.9354 6.0595 3.9651 3.6919 4.0552 1.2298 3.6535 1.3836 1.4189 1.5822 7.2127 3.3692 1.4844 2.6974 6.3722 1.4357 2.6507 2.7486 1.3731 2.8708 1.5406 2.1678 1.3470 2.9647 2.8108 1.1973 1.4659 1.9512 3.2538 1.5419 1.4535 1.6168 1.3965 1.6504 1.6943 1.7811 2.1668 4.7394 2.0112 1.8228 1.5746 1.8668 2.6431 1.6321 1.3451 1.4548 1.2127 1.5487 2.4681 1.5972 5.1030 2.1634 2.3404 1.6193 3.0926 1.6843 5.3755 1.1454 1.1499 1.3347 2.3846 2.4641 1.0496 1.0933 1.0612 1.0505 1.0800 1.0620 1.0576 1.0604 1.0912 1.5248 1.3397 1.2058 6.6110 9.0253 7.0684 6.4475 1.0600 1.0398 1.0634 1.0321 1.0321 1.0366 1.0551 1.1004 1.0991 1.1001 1.1007 1.1079 1.0862 1.1056 1.1057 1.1050 1.1053 1.1057 1.1051 1.0879 1.0955 1.0889 1.0960 1.0931 1.0961
irintensity: 0.2374 2.6658 1.8471 0.2895 2.8064 1.2245 1.8921 0.1921 0.4383 1.2760 0.7036 2.6393 0.5585 0.3639 1.6760 2.0741 1.3221 1.7736 2.2342 0.9078 3.1725 0.8063 1.8605 1.8214 0.9327 2.2647 0.1839 0.3065 11.1825 9.2838 1.2601 3.6167 4.0138 0.6871 11.4489 0.2267 3.7500 3.8348 7.7110 11.7180 4.0495 17.7972 11.2239 1.3982 3.0703 0.1389 16.1389 16.8005 25.1172 4.7176 3.1805 1.3738 4.2943 12.5871 62.8366 17.2437 46.6004 47.4255 105.1981 38.0315 1.0038 5.1125 29.4192 10.0926 20.4280 4.2306 0.1858 15.0292 46.8943 0.1171 17.6177 27.6871 0.0191 8.1566 49.2366 36.5879 16.9056 6.9381 56.0663 4.7879 37.4110 217.7707 31.6740 321.4074 456.5196 22.8774 4.4342 48.5890 1.0089 2.2706 136.5150 7.2439 29.6501 25.5716 186.1509 143.9613 17.4869 101.0710 48.0337 38.0249 42.0812 29.0422 15.1031 95.8714 14.6906 18.4707 2.7351 31.0805 9.1807 0.2399 1.0521 3.9237 14.6980 20.1912 12.5381 40.8176 60.2252 5.9746 187.9489 53.0575 73.8320 49.9675 19.4467 46.7752 519.4528 43.3184 35.5044 70.6083 2.7273 2.2663 4.2222 4.8591 3.7863 11.8193 28.3715 35.7641 4.6314 58.6691 0.3373 0.2690 1.7338 13.7873 1.9523 7.6785 4.5235 21.5481 2.4893 22.0390 9.7780 1.3804
temp: 298.150 k
press: 1.00000 atm
elementType: 17 8 8 7 7 7 7 7 6 6 6 6 6 6 6 6 6 6 6 6 6 6 6 6 6 6 6 1 1 1 1 1 1 1 1 1 1 1 1 1 1 1 1 1 1 1 1 1 1 1 1 1
symmnumber: 1
zpe: 1102472.2 jmol-1
zpe.correction: 0.419909 hartree
zpe.thermalcorrener: 0.447381 hartree
zpe.thermalcorrenthalpy: 0.448325 hartree
zpe.thermalcorrgfe: 0.358412 hartree
zpe.sumelectzpe: -1620.885902 hartree
zpe.sumelectthermal: -1620.858431 hartree
zpe.sumelectthermalent: -1620.857486 hartree
zpe.sumelectthermalfe: -1620.947400 hartree
dipole: -37.0466 -5.3512 1.2144
dipole: 37.4508
quadrupole: 6.0185 -133.3144 -159.8134
quadrupole: 48.3651 -10.3740 -2.4341
quadrupole: 101.7216 -37.6113 -64.1103 48.3651 -10.3740 -2.4341
hfenergy: -1621.3058116 hartree
pointgroup: C01 [X(C19H25Cl1N5O2)]
dipole: -14.5173181 2.5190858 -0.0173091 debye
polarizability: 671.4487838|36.0114644|265.4070972|-21.5006659|31.4061275|148.7649448 unknown
InChI: InChI=1S/C19H25ClN5O2/c1-5-23(12-13-25(2,3)4)16-8-6-15(7-9-16)21-22-19-11-10-17(24(26)27)14-18(19)20/h6-11,14H,5,12-13H2,1-4H3
charge 1 multiplicity 1
52 atoms
Cl 4.068701 -2.678142 -1.128344
O  7.948019 2.178341 0.37946
O  8.513557 0.12764 -0.452122
N  -6.518832 1.852958 -0.22483
N  -4.21703 -1.234818 0.187728
N  1.263929 0.318871 0.238421
N  2.148017 -0.57206 -0.147855
N  7.65179 0.996036 -0.044432
C  -5.5780 0.655664 -0.537544
C  -5.238897 -0.292214 0.647502
C  -5.836938 2.842402 0.719886
C  -6.828515 2.5661 -1.544133
C  -7.825828 1.365602 0.397659
C  -4.661552 -2.615241 -0.142817
C  -2.85237 -0.873946 0.205157
C  -4.533031 -3.603812 1.036125
C  -2.42844 0.429821 0.618692
C  -1.840809 -1.805056 -0.203385
C  -1.068699 0.779477 0.617022
C  -0.489089 -1.449099 -0.209795
C  -0.078192 -0.145726 0.200141
C  3.498049 -0.120001 -0.103083
C  4.509793 -1.02689 -0.537114
C  3.899362 1.171576 0.353864
C  6.215371 0.612598 -0.063474
C  5.869012 -0.674111 -0.522985
C  5.248141 1.54625 0.377705
H  -6.069149 0.080002 -1.341192
H  -4.646123 1.091219 -0.936085
H  -4.887846 0.267766 1.534623
H  -6.130845 -0.863455 0.955845
H  -4.902815 3.194266 0.25632
H  -6.512582 3.69457 0.890932
H  -5.619405 2.349192 1.677873
H  -7.363672 1.873234 -2.210997
H  -7.455276 3.448237 -1.340862
H  -5.883308 2.878697 -2.013411
H  -8.272311 0.601528 -0.256917
H  -7.625569 0.939562 1.391268
H  -8.513841 2.219389 0.495888
H  -4.094024 -2.977435 -1.017935
H  -5.717298 -2.559399 -0.4698
H  -3.487809 -3.683652 1.379374
H  -5.149557 -3.285685 1.896347
H  -4.871254 -4.609488 0.728753
H  -3.147707 1.17601 0.971554
H  -2.112244 -2.818174 -0.510318
H  -0.742908 1.772584 0.943715
H  0.279081 -2.163529 -0.521534
H  3.112838 1.855171 0.685897
H  6.648784 -1.363819 -0.854749
H  5.573321 2.52989 0.72506
