program: Gaussian 09
title: 000273924
version: EM64L-G09RevD.01
frameworkgroup: C1[X(C20H20O4)]
method: RPBEPBE
basis: SDD
operation: Freq
keyword: #pfreq=noraman
keyword: PBEPBE/SDD
title: #p freq=noraman PBEPBE/SDD
converged: YES YES NO NO
title: Mulliken charges:
elementType: O O O O C C C C C C C C C C C C C C C C C C C C H H H H H H H H H H H H H H H H H H H H
charge: -0.276689 -0.301010 -0.259327 -0.235408 -0.219702 -0.127823 -0.695711 -0.668828 0.401253 0.291253 0.397087 0.362575 -0.470832 -0.378865 -0.417930 -0.424661 -0.239191 -0.245067 -0.259424 -0.239363 0.310750 0.293978 -0.763213 -0.768446 0.266068 0.243227 0.253659 0.242624 0.268785 0.243335 0.240486 0.257687 0.258351 0.239128 0.231958 0.227241 0.230435 0.230498 0.258588 0.248398 0.244432 0.251074 0.249450 0.249170
chargesum: 0.00000
title: Mulliken charges with hydrogens summed into heavy atoms:
elementType: O O O O C C C C C C C C C C C C C C C C C C C C
charge: -0.276689 -0.301010 -0.259327 -0.235408 0.046366 0.115404 -0.199428 -0.156709 0.401253 0.291253 0.397087 0.362575 -0.230346 -0.121178 -0.159579 -0.185533 -0.007233 -0.017827 -0.028989 -0.008865 0.310750 0.293978 -0.011795 -0.018752
polarizability: 2.26910718e+02 -2.55413990e+00 2.70793322e+02 -3.17426774e+01 -6.85062609e+00 1.61290809e+02
1716.lowfreq: -10.0044 -3.2000 -0.0004 0.0003 0.0006 5.1900 9.7094 32.6977 34.5786
frequency: -4.0519 32.6703 34.4866 47.9266 55.9618 64.3449 69.5092 74.3641 81.6157 103.1138 125.1963 156.3253 160.6594 185.3759 234.1273 240.4782 267.8199 290.8225 294.7669 307.7706 365.4994 373.5642 385.1810 401.4009 457.3400 478.8263 489.0544 498.3828 539.6195 557.2761 559.7820 565.9908 571.8558 588.5490 617.3121 627.7740 639.2642 667.8171 721.5981 740.1905 753.5113 766.0309 770.0923 781.5000 810.3398 820.4571 866.1878 877.9092 887.6941 890.9387 908.3913 919.2661 953.1416 954.0987 962.4731 970.5157 988.9309 991.9176 992.7020 995.8218 997.9555 1033.7596 1041.7305 1045.2945 1047.6746 1054.3924 1083.5606 1117.1804 1170.5985 1174.0396 1177.1593 1178.5733 1186.2459 1192.2611 1203.9173 1214.8468 1227.3179 1232.7513 1259.0937 1275.0316 1287.4945 1304.2860 1330.5178 1337.3458 1346.1358 1353.5840 1381.5421 1382.8197 1383.4713 1389.2299 1437.6633 1439.3701 1453.4317 1454.4714 1455.7820 1458.1995 1472.4908 1477.6578 1485.6705 1489.1427 1588.1809 1590.2399 1611.4452 1612.3381 1642.2569 1651.5576 2997.3284 3004.3984 3007.1349 3012.9655 3023.7667 3025.1260 3069.2785 3086.0811 3096.5995 3097.9926 3117.2287 3123.3233 3123.6738 3134.7648 3138.1073 3140.4705 3141.4065 3150.8602 3163.0743 3165.1742
redmass: 1.0987 6.4018 5.8741 4.9105 4.9322 1.9858 4.3735 2.8386 1.7436 3.6969 5.2692 4.1503 4.2374 6.0419 4.5914 4.8388 5.0201 4.6371 4.8714 4.1367 2.5355 3.7007 3.4541 2.5778 3.5837 3.9883 3.4306 4.5865 3.6255 4.0492 4.1572 3.5677 3.5363 4.9641 4.6862 4.7288 5.3628 4.7503 3.4123 4.3550 3.1090 1.4726 1.6274 2.4431 4.1382 4.6927 1.9846 3.0930 1.7967 2.1620 4.1034 3.7756 1.8870 1.5933 1.7571 2.7047 2.3525 1.4599 1.3720 2.0163 2.2211 3.7030 1.6531 1.6819 2.2920 2.1409 2.3767 1.9066 1.2251 1.2524 1.4126 1.2621 1.6736 2.6248 3.1094 2.0078 1.4160 2.1559 1.4095 1.3170 1.5274 1.2931 1.3843 1.3837 1.6595 1.3591 1.5895 1.3213 2.4843 3.2300 2.2693 2.2754 1.0614 1.0536 1.0636 1.0487 1.1700 1.3255 1.7393 2.3885 6.7251 6.5737 6.3670 6.4314 9.2718 10.5746 1.0641 1.0381 1.0369 1.0810 1.0842 1.0642 1.0976 1.1020 1.0963 1.0945 1.0870 1.0888 1.0854 1.0899 1.1016 1.1021 1.0930 1.0940 1.1007 1.0993
irintensity: 0.7420 1.2783 0.7331 0.4851 0.6849 2.9432 0.6132 2.0651 1.6344 0.9672 1.3082 0.7348 4.6636 6.4476 6.8190 0.5597 0.0871 2.2686 1.4836 0.7428 2.2860 1.1493 5.7055 0.2908 0.8675 18.1974 3.3019 1.0558 27.9036 5.1466 5.4919 5.4235 1.1671 6.1936 1.6518 3.6656 6.3479 36.9347 1.7178 2.4252 1.7683 21.5697 65.9976 29.0471 3.3713 7.0097 2.4148 10.6362 11.1506 11.0436 51.3661 59.2176 53.4047 10.7954 42.9914 1.6200 4.8363 7.3058 7.2186 104.9542 41.9398 19.8622 13.2349 2.3331 19.4700 1.7177 10.8126 10.0958 14.9514 32.7470 75.7776 22.5512 17.0864 367.3454 178.1521 5.0741 8.5563 4.2051 14.3353 5.7470 5.0035 10.4960 1.5839 3.1105 0.9849 8.4133 37.1830 53.7812 17.1503 4.2899 11.1414 0.6241 16.8952 15.4279 13.9366 15.4951 24.0879 14.9228 27.6152 17.1711 2.4416 0.9755 4.0877 2.0776 158.5372 169.0457 14.9780 1.8550 2.8424 7.1923 19.0022 10.0368 12.8854 4.6991 6.5009 8.8322 9.0664 2.7387 0.6557 10.4006 8.5758 8.6105 23.2422 19.2768 34.7714 22.8520
temp: 298.150 k
press: 1.00000 atm
elementType: 8 8 8 8 6 6 6 6 6 6 6 6 6 6 6 6 6 6 6 6 6 6 6 6 1 1 1 1 1 1 1 1 1 1 1 1 1 1 1 1 1 1 1 1
symmnumber: 1
zpe: 921627.0 jmol-1
zpe.correction: 0.351029 hartree
zpe.thermalcorrener: 0.372301 hartree
zpe.thermalcorrenthalpy: 0.373246 hartree
zpe.thermalcorrgfe: 0.299507 hartree
zpe.sumelectzpe: -1073.314577 hartree
zpe.sumelectthermal: -1073.293305 hartree
zpe.sumelectthermalent: -1073.292361 hartree
zpe.sumelectthermalfe: -1073.366099 hartree
dipole: -0.9100 0.6562 2.8829
dipole: 3.0935
quadrupole: -135.8172 -125.8511 -142.4831
quadrupole: 3.1088 -7.8046 -4.4248
quadrupole: -1.1001 8.8661 -7.7660 3.1088 -7.8046 -4.4248
hfenergy: -1073.6656065 hartree
pointgroup: C01 [X(C20H20O4)]
dipole: -0.0511685 0.4783259 1.1179784 debye
polarizability: 229.6313112|17.0918183|261.7253531|-38.8481393|3.0372628|167.6381843 unknown
InChI: InChI=1S/C20H20O4/c1-13(21)23-19-11-15-7-4-6-10-18(15)20(24-14(2)22)12-16-8-3-5-9-17(16)19/h3-10,19-20H,11-12H2,1-2H3
charge 0 multiplicity 1
44 atoms
O  1.802964 -1.429719 0.51065
O  -2.221855 1.728629 0.813938
O  2.245207 -3.409013 -0.643186
O  -3.023688 2.220552 -1.32845
C  1.7393 -0.700224 -0.805416
C  -1.127169 0.90015 0.21743
C  0.376989 -0.990815 -1.539386
C  0.13164 1.112017 1.119623
C  2.083809 0.758319 -0.537918
C  -1.551943 -0.560409 0.132928
C  -0.794842 -1.453547 -0.678461
C  1.345809 1.604591 0.345878
C  3.20327 1.289202 -1.22603
C  -2.642585 -1.049298 0.888821
C  -1.164353 -2.821782 -0.71155
C  1.762812 2.949525 0.503645
C  3.601017 2.634875 -1.068048
C  -2.998567 -2.415463 0.846332
C  -2.255573 -3.307512 0.042236
C  2.874608 3.471471 -0.194295
C  2.047231 -2.806601 0.437617
C  -3.122395 2.324627 -0.086482
C  2.013083 -3.42547 1.816236
C  -4.196079 3.087224 0.65923
H  2.535893 -1.136648 -1.435218
H  -0.949054 1.302461 -0.797921
H  0.578997 -1.783839 -2.278757
H  0.109544 -0.079366 -2.107814
H  0.36885 0.167427 1.636397
H  -0.145464 1.855284 1.887173
H  3.776859 0.634305 -1.893456
H  -3.212891 -0.350951 1.509315
H  -0.585827 -3.509651 -1.339491
H  1.202498 3.597249 1.188488
H  4.469525 3.019292 -1.613435
H  -3.84989 -2.777651 1.433522
H  -2.524795 -4.368533 -0.004427
H  3.170996 4.516598 -0.05239
H  0.959581 -3.587769 2.110045
H  2.471137 -2.754947 2.560498
H  2.52925 -4.396712 1.801234
H  -3.970912 3.151878 1.733449
H  -5.165641 2.576124 0.519872
H  -4.294847 4.098016 0.229375
