program: Gaussian 09
title: 000273896
version: EM64L-G09RevD.01
frameworkgroup: C1[X(C15H21NO2)]
method: RPBEPBE
basis: SDD
operation: Freq
keyword: #p
keyword: freq=noraman
keyword: PBEPBE/SDD
title: #p freq=noraman PBEPBE/SDD
converged: NO YES NO NO
title: Mulliken charges:
elementType: O O N C C C C C C C C C C C C C C C H H H H H H H H H H H H H H H H H H H H H
charge: -0.437799 -0.264001 -0.442208 -0.123138 -0.089850 -0.420879 -0.464648 -0.376536 -0.391882 -0.419611 -0.374115 0.153590 0.258451 -0.345732 -0.370041 -0.224090 -0.235240 -0.226469 0.288864 0.228115 0.184909 0.241579 0.238223 0.176402 0.201631 0.200047 0.210637 0.193474 0.195762 0.203554 0.200696 0.197571 0.301538 0.337818 0.275185 0.221100 0.233420 0.230236 0.233438
chargesum: 0.00000
title: Mulliken charges with hydrogens summed into heavy atoms:
elementType: O O N C C C C C C C C C C C C C C C
charge: -0.099981 -0.264001 -0.140670 0.165725 0.138266 0.005608 -0.050023 0.025142 0.012229 -0.020295 0.024152 0.153590 0.258451 -0.070547 -0.148941 0.009330 -0.005004 0.006969
polarizability: 2.29663011e+02 -1.81999836e+00 1.66983839e+02 8.60299304e+00 -8.90274021e+00 1.19825495e+02
1716.lowfreq: -17.5518 -12.6865 -2.8447 -0.0003 0.0001 0.0005 21.1525 28.9449 42.1111
frequency: 20.3696 28.1731 42.0322 56.8167 101.0074 125.2588 159.3708 166.5046 198.6185 211.0238 226.1167 265.4408 299.0511 305.8714 317.7377 354.8760 364.0071 402.9822 412.0066 427.1132 452.2191 468.3213 506.2456 530.8322 563.3044 602.8593 615.2927 655.1798 687.3051 702.1040 703.8223 772.8325 788.2402 795.3863 816.4409 851.8529 856.2862 864.2324 890.5090 935.8938 951.0052 969.6401 984.2931 986.6651 989.8398 993.9153 1006.0859 1022.3721 1024.0134 1043.1478 1082.1675 1097.2604 1107.5374 1112.5278 1121.7159 1135.0095 1145.0007 1173.7584 1188.5242 1195.8253 1211.6850 1218.2787 1239.3517 1254.4275 1261.6793 1271.8194 1308.1327 1315.7173 1323.4822 1331.7993 1333.8749 1340.2408 1346.8951 1350.2646 1364.4250 1373.0221 1381.3488 1385.0582 1432.3280 1457.5804 1460.7370 1463.7165 1471.4234 1475.5945 1478.8556 1486.7770 1492.6447 1574.7839 1606.6912 1610.9720 2953.9952 2954.6603 2971.3473 2974.7342 2981.3305 2987.0607 3010.9498 3016.6970 3022.8910 3026.2388 3031.9432 3038.9770 3047.4542 3064.7236 3117.0719 3132.2511 3145.0646 3158.2632 3169.7744 3513.9253 3529.0484
redmass: 4.1862 4.5485 3.7509 5.4937 4.4957 3.9272 4.2023 3.7388 2.5796 3.3560 2.2180 2.9755 3.5549 2.1353 2.4813 2.4984 1.7699 2.8235 4.2890 3.7258 2.5467 1.7863 2.5634 2.8564 2.3463 1.7668 5.2962 4.7250 5.0188 1.9888 1.5314 2.4602 1.7933 2.0318 2.2173 2.9845 1.3371 1.7871 1.9963 1.4386 4.2508 1.9817 1.4189 2.3981 3.7405 2.4581 1.3456 2.5532 2.2836 2.4890 1.5757 2.3126 1.6790 2.3524 2.2966 1.7110 2.2137 1.0584 1.1257 1.3055 1.3383 1.2626 1.3690 1.7819 1.1682 1.1991 1.4531 1.3268 1.2488 1.2774 1.2841 1.3991 1.4440 1.4381 1.3765 1.3717 1.3239 9.1302 2.1804 1.6818 1.0911 1.0817 1.0871 1.1742 1.1323 1.8582 1.1146 6.4490 6.8738 6.1830 1.0621 1.0643 1.0642 1.0625 1.0635 1.0633 1.0961 1.0969 1.0942 1.0938 1.0988 1.0965 1.0967 1.0871 1.0874 1.0869 1.0921 1.0956 1.1007 1.0654 1.0761
irintensity: 0.8338 0.2672 0.5905 5.0394 0.1660 1.8718 0.8184 0.2469 2.2428 4.1637 0.1463 3.4178 18.0673 7.0965 3.3561 2.6710 81.5572 0.3661 4.1702 3.2839 1.3407 2.6102 17.0982 16.4446 47.1044 52.2463 3.7734 12.6951 7.2010 6.5387 84.5958 2.6231 23.5725 20.9413 5.2086 4.7231 2.1177 6.9880 1.2804 2.5754 79.9207 2.8073 1.3758 4.8883 0.3633 1.3399 1.4840 10.3962 12.0075 3.0794 15.6727 2.6025 3.3294 4.9124 9.6279 11.1406 12.1177 0.8931 13.6479 29.4585 5.0563 12.6787 12.6956 79.1209 2.8570 6.4797 89.1774 1.9627 4.7194 0.8717 1.7815 1.6867 0.5001 38.8373 2.2229 7.8280 19.8368 1.8729 11.3403 247.3607 15.8293 7.3729 4.7263 23.5720 6.6847 84.4948 38.7448 77.1347 72.1557 6.3673 53.8348 16.4721 31.2789 14.9204 14.1744 38.4069 58.1895 14.9192 2.1452 43.8697 88.0706 81.3441 16.7180 59.0962 11.8415 1.6021 22.2474 15.3781 21.3459 10.2723 10.1273
temp: 298.150 k
press: 1.00000 atm
elementType: 8 8 7 6 6 6 6 6 6 6 6 6 6 6 6 6 6 6 1 1 1 1 1 1 1 1 1 1 1 1 1 1 1 1 1 1 1 1 1
symmnumber: 1
zpe: 875342.6 jmol-1
zpe.correction: 0.333400 hartree
zpe.thermalcorrener: 0.350625 hartree
zpe.thermalcorrenthalpy: 0.351569 hartree
zpe.thermalcorrgfe: 0.287031 hartree
zpe.sumelectzpe: -788.027931 hartree
zpe.sumelectthermal: -788.010707 hartree
zpe.sumelectthermalent: -788.009762 hartree
zpe.sumelectthermalfe: -788.074300 hartree
dipole: -0.0287 2.4949 -4.1899
dipole: 4.8766
quadrupole: -92.3571 -108.2823 -120.4675
quadrupole: -6.1090 0.2207 0.3049
quadrupole: 14.6785 -1.2466 -13.4319 -6.1090 0.2207 0.3049
hfenergy: -788.3613316 hartree
pointgroup: C01 [X(C15H21N1O2)]
dipole: 0.033139 -0.7813853 -1.7519504 debye
polarizability: 229.8694803|-1.0468186|164.2612553|-7.3552583|14.1495073|122.3416095 unknown
InChI: InChI=1S/C15H21NO2/c17-14-11-7-2-1-6-10-13(14)16-15(18)12-8-4-3-5-9-12/h3-5,8-9,13-14,16-17H,1-2,6-7,10-11H2
charge 0 multiplicity 1
39 atoms
O  -1.521337 -1.216246 2.336497
O  1.173855 1.785877 1.347259
N  0.06959 0.051323 0.246819
C  -1.287258 0.525308 0.611737
C  -2.142234 -0.666933 1.113127
C  -1.896921 1.381669 -0.534825
C  -2.418726 -1.820463 0.121117
C  -3.400488 1.748262 -0.367925
C  -3.284095 -1.493176 -1.127696
C  -4.397162 0.893178 -1.196471
C  -4.543685 -0.615724 -0.85931
C  1.22088 0.746087 0.61864
C  2.526985 0.193677 0.102782
C  3.642006 1.06995 0.078519
C  2.691213 -1.149569 -0.327674
C  4.893264 0.620989 -0.391233
C  3.946251 -1.600285 -0.793115
C  5.04824 -0.714836 -0.832532
H  -1.133152 1.184581 1.486637
H  -3.103999 -0.263406 1.469972
H  -1.748486 0.870972 -1.505928
H  -1.289708 2.305147 -0.580861
H  -2.931884 -2.598813 0.717864
H  -1.4585 -2.279289 -0.199588
H  -3.537688 2.800011 -0.686536
H  -3.681914 1.72664 0.704297
H  -3.604205 -2.46288 -1.556635
H  -2.672359 -1.010574 -1.914168
H  -4.118295 0.981158 -2.267935
H  -5.399621 1.359314 -1.10288
H  -4.873513 -0.738954 0.192221
H  -5.377678 -1.000659 -1.47885
H  0.140136 -0.626603 -0.515702
H  -0.547841 -1.305395 2.157946
H  3.5003 2.093585 0.440316
H  1.860528 -1.863577 -0.267818
H  5.746961 1.3071 -0.4115
H  4.067513 -2.641036 -1.112935
H  6.021121 -1.065811 -1.194134
