program: Gaussian 09
title: 000273903
version: EM64L-G09RevD.01
frameworkgroup: C1[X(C16H20N2O6)]
method: RPBEPBE
basis: SDD
operation: Freq
keyword: #p
keyword: freq=noraman
keyword: PBEPBE/SDD
title: #p freq=noraman PBEPBE/SDD
converged: NO YES NO NO
title: Mulliken charges:
elementType: O O O O O O N N C C C C C C C C C C C C C C C C H H H H H H H H H H H H H H H H H H H H
charge: -0.324669 -0.244053 -0.187701 -0.182137 -0.183268 -0.184297 0.020087 0.022505 0.354472 -0.447792 -0.454805 -0.409395 -0.387525 -0.398532 -0.424200 -0.367306 -0.744028 0.217339 0.283465 -0.491007 -0.476502 0.438966 0.432354 -0.493041 0.209970 0.247968 0.220160 0.219224 0.204221 0.207390 0.207285 0.190570 0.208355 0.201587 0.203196 0.203727 0.199525 0.192095 0.227936 0.261788 0.226149 0.330718 0.329046 0.340158
chargesum: 0.00000
title: Mulliken charges with hydrogens summed into heavy atoms:
elementType: O O O O O O N N C C C C C C C C C C C C C C C C
charge: -0.324669 -0.244053 -0.187701 -0.182137 -0.183268 -0.184297 0.020087 0.022505 0.354472 0.010146 -0.015421 0.002216 0.010331 0.011411 -0.017278 0.024314 -0.028156 0.217339 0.283465 -0.160289 -0.147456 0.438966 0.432354 -0.152883
polarizability: 2.80852826e+02 5.17771752e+00 2.26658326e+02 -1.64832286e+01 -3.00346227e+00 1.38978251e+02
1716.lowfreq: -1.4086 -0.0006 -0.0003 0.0005 5.0506 7.5023 21.5882 28.2911 47.3509
frequency: 20.1584 27.9999 47.2084 50.3101 51.3709 68.0586 99.0529 111.0916 134.0164 141.8072 170.6484 195.7297 198.2862 200.4683 210.2343 219.0346 225.7368 254.5976 265.8848 300.5190 316.1560 334.5635 344.0322 357.6883 371.7654 379.3607 429.4924 448.4493 465.7056 475.7201 481.8666 505.2155 517.5276 552.5891 582.3153 635.7945 659.0215 683.6678 698.1225 705.0312 724.8444 735.4897 743.5592 751.5459 766.6310 782.4462 795.8871 846.7271 866.7554 871.7077 887.0160 892.8712 937.8822 954.3715 973.4476 978.9791 987.3375 992.3125 993.0425 1006.0606 1027.2269 1051.0911 1067.7454 1089.2066 1098.5687 1102.2157 1121.4083 1132.7217 1138.4757 1157.2512 1169.5898 1205.9258 1207.9331 1222.8444 1228.9717 1241.6412 1249.4891 1260.8926 1265.4118 1286.3514 1313.9486 1327.5047 1338.8658 1341.5568 1346.6225 1354.1867 1369.1724 1375.5666 1379.4102 1382.6996 1386.9773 1405.9904 1434.6264 1452.0363 1459.2114 1462.5140 1463.6113 1464.2638 1468.9429 1471.2357 1482.3662 1485.7967 1503.1775 1584.8146 1614.3142 1616.7952 2958.2932 2967.0382 2970.5419 2976.0175 2984.2338 2991.3575 2997.9197 3000.4099 3014.0135 3019.8916 3023.9221 3033.4375 3039.9433 3057.6989 3065.6103 3082.7414 3114.7032 3179.4463 3192.7156 3199.7745
redmass: 6.3281 5.0146 5.8083 15.1079 8.0902 5.7374 4.2704 8.8275 9.9653 3.6997 3.9398 4.6282 3.2507 4.7923 2.0594 1.2126 3.3475 2.6363 2.6954 4.3072 4.7308 7.4438 4.1370 3.9301 2.9445 2.3974 2.0805 4.7974 5.6670 4.6817 1.7436 8.1232 3.3569 2.6340 4.3690 6.2204 3.9091 12.2965 2.9106 4.1311 9.1734 3.4324 6.3530 3.1099 2.5264 3.0479 1.8805 1.8634 10.8565 1.9443 1.9956 6.8362 1.8663 1.7081 1.4276 1.6108 5.7035 1.8384 1.4022 1.8800 1.9082 1.9496 1.4355 1.5028 1.8076 2.4599 2.2643 3.8088 1.9698 1.5296 1.3856 6.8010 8.4243 1.5209 1.2289 1.6008 1.3505 2.9591 1.4135 1.2771 1.2948 1.4630 1.4304 1.4190 1.3904 1.4088 1.4229 1.3603 10.4235 10.2306 1.2496 5.5298 5.8449 1.0846 3.7506 1.0979 1.0784 1.0841 1.0855 1.0818 1.0696 1.0772 1.0793 8.4937 9.2536 8.7162 1.0605 1.0634 1.0615 1.0629 1.0647 1.0378 1.0671 1.0677 1.0940 1.0965 1.0972 1.0985 1.1000 1.0975 1.0975 1.0981 1.1000 1.0925 1.0928 1.0927
irintensity: 0.0120 0.0215 0.0514 0.0012 0.0241 0.0947 0.4499 8.5606 4.2200 1.8166 0.8993 0.0852 0.4745 0.1484 1.2895 0.9289 3.0574 0.2956 0.0428 0.6652 7.3764 0.3314 7.4591 0.8638 0.6725 2.0637 1.1819 1.3247 0.0215 0.8927 0.8815 5.4212 1.6982 1.6408 0.5128 2.3814 3.6306 42.3508 40.9851 16.6947 0.0081 36.8911 11.0357 3.8215 2.6628 41.3768 5.1504 11.5023 12.6615 3.1462 4.2178 36.8601 2.3182 2.0342 14.3547 25.2848 3.7196 12.3283 4.1568 11.8400 6.1003 5.4586 119.5063 5.5763 48.0975 273.1076 74.0637 47.9020 1.5897 8.8442 5.7306 244.8101 393.8057 5.7955 0.2514 11.7859 5.4095 79.4933 16.3607 3.8478 0.1233 1.2455 6.3108 1.9587 0.1753 0.5129 4.2132 15.8721 44.9217 139.5875 27.6657 8.7338 16.7875 4.9015 35.4971 2.1272 2.8235 22.0648 15.4472 8.9155 8.1525 16.1237 36.4647 9.2275 87.1090 49.2947 31.6819 24.9823 19.0617 18.4912 37.9772 14.4445 20.3542 11.5008 72.9349 2.2271 63.3414 60.9985 112.0209 14.4962 29.1790 31.5547 10.2490 15.1412 26.4792 8.9068
temp: 298.150 k
press: 1.00000 atm
elementType: 8 8 8 8 8 8 7 7 6 6 6 6 6 6 6 6 6 6 6 6 6 6 6 6 1 1 1 1 1 1 1 1 1 1 1 1 1 1 1 1 1 1 1 1
symmnumber: 1
zpe: 908600.2 jmol-1
zpe.correction: 0.346068 hartree
zpe.thermalcorrener: 0.368720 hartree
zpe.thermalcorrenthalpy: 0.369664 hartree
zpe.thermalcorrgfe: 0.292844 hartree
zpe.sumelectzpe: -1180.582164 hartree
zpe.sumelectthermal: -1180.559512 hartree
zpe.sumelectthermalent: -1180.558568 hartree
zpe.sumelectthermalfe: -1180.635388 hartree
dipole: 6.5115 -0.1733 -0.6388
dipole: 6.5450
quadrupole: -154.7407 -167.6732 -136.3320
quadrupole: -2.2274 2.0371 2.1234
quadrupole: -1.8254 -14.7579 16.5833 -2.2274 2.0371 2.1234
hfenergy: -1180.9282319 hartree
pointgroup: C01 [X(C16H20N2O6)]
dipole: 2.5513268 -0.2376722 -0.254877 debye
polarizability: 280.0201479|-3.8841137|213.3087348|-20.5246112|-31.141427|153.1605205 unknown
InChI: InChI=1S/C16H20N2O6/c1-16(7-5-3-2-4-6-8-16)24-15(19)12-9-13(17(20)21)11-14(10-12)18(22)23/h9-11H,2-8H2,1H3
charge 0 multiplicity 1
44 atoms
O  1.220614 -0.546398 -0.550828
O  0.30373 -2.43715 0.505347
O  -1.477058 3.296747 -1.683524
O  -4.553164 -2.324851 1.508878
O  -3.710566 3.332814 -1.216737
O  -5.805234 -0.496289 0.963335
N  -2.553745 2.76634 -1.21423
N  -4.693545 -1.14599 1.010018
C  2.670928 -1.070598 -0.612393
C  3.181515 -1.343112 0.822201
C  3.376045 0.087651 -1.364665
C  3.043535 -0.226534 1.883545
C  4.932217 0.077436 -1.296907
C  3.840813 1.090189 1.670732
C  5.562157 1.106037 -0.320623
C  5.314027 0.914108 1.199854
C  2.685565 -2.359832 -1.458944
C  0.203969 -1.289017 0.005429
C  -1.102648 -0.537713 -0.05199
C  -2.250662 -1.167373 0.482765
C  -1.198122 0.75693 -0.612236
C  -2.451707 1.399445 -0.625246
C  -3.480752 -0.484054 0.445617
C  -3.615645 0.805202 -0.103211
H  4.24692 -1.628633 0.72477
H  2.659732 -2.24115 1.199229
H  2.995905 1.04736 -0.974985
H  3.046039 0.034181 -2.419364
H  3.375697 -0.67399 2.842164
H  1.972377 0.021251 2.022373
H  5.324198 0.302699 -2.307583
H  5.305946 -0.938774 -1.056739
H  3.833352 1.628854 2.638796
H  3.309659 1.754568 0.963016
H  5.20807 2.118797 -0.60575
H  6.658323 1.10486 -0.491264
H  5.944882 1.659158 1.723814
H  5.696283 -0.077037 1.520229
H  3.733822 -2.639122 -1.671708
H  2.199288 -3.19807 -0.936004
H  2.17848 -2.193202 -2.425822
H  -2.175374 -2.168627 0.916999
H  -0.317679 1.251447 -1.027656
H  -4.579287 1.320343 -0.122206
