program: Gaussian 09
title: 000273882
version: EM64L-G09RevD.01
frameworkgroup: C1[X(C14H18ClN3)]
method: RPBEPBE
basis: SDD
operation: Freq
keyword: #p
keyword: freq=noraman
keyword: PBEPBE/SDD
title: #p freq=noraman PBEPBE/SDD
converged: NO YES NO NO
title: Mulliken charges:
elementType: Cl N N N C C C C C C C C C C C C C C H H H H H H H H H H H H H H H H H H
charge: -0.065728 -0.385804 -0.334489 -0.052839 -0.423723 -0.427464 -0.371672 0.368286 0.267391 -0.316011 -0.024843 -0.329713 -0.344174 -0.296347 -0.382863 -0.684152 -0.273780 -0.090070 0.206693 0.231697 0.221052 0.227956 0.209024 0.232778 0.334906 0.249940 0.216942 0.191359 0.217470 0.208623 0.285279 0.230964 0.206254 0.223194 0.220724 0.253139
chargesum: 0.00000
title: Mulliken charges with hydrogens summed into heavy atoms:
elementType: Cl N N N C C C C C C C C C C C C C C
charge: -0.065728 -0.050898 -0.084549 -0.052839 0.014668 0.021544 0.070130 0.368286 0.267391 0.092290 -0.024843 -0.112243 -0.135552 -0.011068 -0.151899 -0.033980 -0.020641 -0.090070
polarizability: 2.46391932e+02 -2.54056987e+01 2.19338025e+02 -1.82038061e+01 -1.20909832e+01 1.07790686e+02
1716.lowfreq: -11.6468 -5.4382 -2.9600 -0.0026 -0.0018 -0.0017 15.5384 22.3080 31.7974
frequency: 15.1035 22.2012 30.9339 73.6393 78.4568 95.0416 124.6324 136.3250 167.9744 187.9683 224.3015 244.3074 247.3835 257.4428 287.4327 315.3973 364.4792 401.0361 415.1952 426.6301 461.0488 495.5863 503.2786 559.6006 583.3184 608.7241 631.3111 643.1315 652.5476 706.1157 720.9567 762.6287 778.0638 809.5090 810.6053 820.6148 833.6778 862.6041 865.4040 895.5011 902.9397 935.7992 949.5051 960.0731 980.1186 1024.7946 1050.4256 1061.5786 1073.3014 1093.0527 1114.0860 1128.0262 1143.3891 1151.6627 1170.8483 1206.5382 1214.3717 1227.8470 1245.9794 1263.3590 1276.9239 1314.8603 1321.2999 1335.3047 1343.3969 1348.3372 1370.0326 1384.3413 1392.1270 1395.8729 1415.6119 1439.3171 1440.2460 1463.5546 1471.0198 1473.0921 1478.6166 1484.3023 1487.8489 1500.5444 1534.2857 1553.0931 1586.0801 1608.5280 2884.3794 2895.4226 2980.3355 2982.5269 3006.4719 3012.6591 3016.5284 3047.1108 3073.4797 3075.7546 3091.6546 3114.7751 3123.2383 3167.0181 3173.5716 3182.5982 3399.3378 3472.5336
redmass: 4.9479 4.4974 3.1743 3.7201 3.6772 2.0621 4.3610 3.1693 3.7583 2.3518 4.1364 1.8310 1.9663 5.0223 4.5951 3.1006 4.4984 3.9170 2.9027 3.0210 4.6565 3.2933 4.0955 4.1680 3.8730 3.8143 4.9471 3.2499 1.7890 1.5041 2.2116 1.9012 1.8124 1.3833 1.4186 1.7031 4.1437 3.9022 3.1694 1.5027 1.5448 1.3488 1.4078 2.1127 2.2127 2.8412 1.8220 1.9105 2.6322 2.4249 1.9208 1.9458 2.0507 2.4550 1.8349 1.9202 1.3847 1.4200 1.4157 1.1665 1.1692 2.5080 1.4273 1.6945 1.3975 1.5348 1.8839 1.3384 4.3940 1.2799 2.7682 1.1857 2.4375 1.0868 1.2927 1.5820 1.0521 1.1460 1.0813 1.1014 4.5796 3.7822 6.3713 6.9573 1.0711 1.0707 1.0375 1.0626 1.0887 1.0878 1.0637 1.0983 1.0986 1.1035 1.1000 1.0895 1.0886 1.0931 1.0950 1.0932 1.0738 1.0758
irintensity: 0.2039 0.8557 1.5793 0.3143 0.2152 0.5869 0.8005 9.5669 1.4658 3.1527 0.3674 0.1792 1.6665 0.8348 0.5481 1.4860 4.0619 0.3742 3.8819 3.8088 9.2702 3.2060 4.9632 11.7504 3.4639 16.6339 16.1099 3.7745 60.5769 82.2769 21.8614 18.6835 23.8152 48.4506 20.6986 9.9697 32.9689 54.8057 30.3939 24.4275 6.6445 1.1408 1.6273 1.6006 7.6238 6.8310 4.6026 13.2039 7.6714 12.7640 5.4963 8.9612 28.1275 44.8093 3.7365 2.2623 34.9305 8.2248 0.7520 8.5975 18.6310 7.9944 20.3722 19.2746 6.8897 26.7204 1.4506 6.6859 66.1538 27.8288 13.1661 30.6242 55.8874 8.1318 7.0047 44.6652 8.4440 14.2177 12.9227 9.6334 72.1794 138.8405 430.1038 69.7500 67.1742 145.1746 29.4796 41.7928 19.7455 37.6570 34.4699 47.0162 44.7370 37.9928 41.6583 31.4794 12.3365 27.8204 4.8931 0.7330 1.1553 157.5101
temp: 298.150 k
press: 1.00000 atm
elementType: 17 7 7 7 6 6 6 6 6 6 6 6 6 6 6 6 6 6 1 1 1 1 1 1 1 1 1 1 1 1 1 1 1 1 1 1
symmnumber: 1
zpe: 778385.2 jmol-1
zpe.correction: 0.296471 hartree
zpe.thermalcorrener: 0.314101 hartree
zpe.thermalcorrenthalpy: 0.315045 hartree
zpe.thermalcorrgfe: 0.248090 hartree
zpe.sumelectzpe: -1167.266500 hartree
zpe.sumelectthermal: -1167.248871 hartree
zpe.sumelectthermalent: -1167.247926 hartree
zpe.sumelectthermalfe: -1167.314882 hartree
dipole: 8.3434 1.4027 -0.3251
dipole: 8.4667
quadrupole: -112.7696 -111.2566 -118.0473
quadrupole: -2.2583 0.9250 -0.1027
quadrupole: 1.2549 2.7679 -4.0228 -2.2583 0.9250 -0.1027
hfenergy: -1167.5629716 hartree
pointgroup: C01 [X(C14H18Cl1N3)]
dipole: 3.2848737 -0.2794559 -0.4769454 debye
polarizability: 227.1973565|-33.0257164|229.922105|-30.7382873|-17.0278661|116.4011809 unknown
InChI: InChI=1S/C14H18ClN3/c1-2-16-7-3-8-17-13-6-9-18-14-10-11(15)4-5-12(13)14/h4-6,9-10,16-17H,2-3,7-8H2,1H3
charge 0 multiplicity 1
36 atoms
Cl -4.024364 3.390136 0.431773
N  1.220924 -0.983752 -0.785075
N  3.760224 0.475313 -0.215794
N  -2.604835 -1.561727 1.075271
C  3.234311 -1.899081 0.433705
C  2.318334 -1.956929 -0.824689
C  3.481148 -0.450327 0.914574
C  -0.00496 -1.178093 -0.178318
C  -0.945251 -0.067712 -0.062284
C  3.993796 1.883319 0.199423
C  -2.219582 -0.320279 0.579802
C  -0.42181 -2.429112 0.337327
C  -0.670408 1.249635 -0.547118
C  -3.156577 0.755356 0.724263
C  -1.704613 -2.55931 0.93255
C  4.297595 2.7741 -1.016467
C  -1.593786 2.29078 -0.401738
C  -2.83185 2.018401 0.243799
H  4.193196 -2.399227 0.189096
H  2.782663 -2.464868 1.270203
H  1.920332 -2.976367 -0.967873
H  2.920748 -1.723287 -1.720504
H  4.292986 -0.45069 1.681105
H  2.570136 -0.078157 1.421441
H  1.564086 -0.029182 -0.938142
H  4.549377 0.135403 -0.788099
H  3.076544 2.240524 0.707247
H  4.822775 1.968712 0.943955
H  0.228475 -3.30655 0.293585
H  0.27098 1.473773 -1.06227
H  -4.108479 0.538304 1.214848
H  -2.012402 -3.53706 1.324576
H  5.221197 2.447578 -1.531976
H  3.468192 2.7351 -1.74489
H  4.441494 3.82409 -0.705452
H  -1.378796 3.294186 -0.779154
