program: Gaussian 09
title: 000274077
version: EM64L-G09RevD.01
frameworkgroup: C1[X(C18H22N6O9)]
method: RPBEPBE
basis: SDD
operation: Freq
keyword: #p
keyword: freq=noraman
keyword: PBEPBE/SDD
title: #p freq=noraman PBEPBE/SDD
converged: YES YES NO NO
title: Mulliken charges:
elementType: O O O O O O O O O N N N N N N C C C C C C C C C C C C C C C C C C H H H H H H H H H H H H H H H H H H H H H H
charge: -0.253904 -0.277727 -0.334682 -0.256887 -0.242478 -0.224057 -0.214164 -0.246966 -0.312071 -0.217259 -0.087145 -0.429068 -0.367123 -0.045247 -0.631957 -0.102964 -0.097759 -0.190576 -0.138308 -0.346093 0.382146 0.208492 -0.144290 0.332123 0.314103 0.004303 0.122899 -0.772250 0.322118 -0.774097 0.278092 -0.764659 -0.779645 0.312022 0.317842 0.352025 0.309857 0.261237 0.258595 0.387508 0.349753 0.246468 0.276572 0.251538 0.265803 0.255084 0.270322 0.305208 0.347262 0.244907 0.277388 0.247173 0.260811 0.228844 0.260883
chargesum: 0.00000
title: Mulliken charges with hydrogens summed into heavy atoms:
elementType: O O O O O O O O O N N N N N N C C C C C C C C C C C C C C C C C C
charge: -0.253904 -0.277727 -0.334682 -0.256887 -0.242478 -0.224057 -0.214164 -0.246966 -0.312071 -0.217259 -0.087145 -0.041560 -0.017370 -0.045247 0.020513 0.209058 0.220084 0.161449 0.171549 0.173739 0.382146 0.208492 -0.144290 0.332123 0.314103 0.004303 0.122899 0.002328 0.322118 0.017112 0.278092 0.004810 -0.029107
polarizability: 3.28812798e+02 -9.66305231e+00 3.43335232e+02 -1.95933864e+00 5.61143099e+00 1.67965221e+02
1716.lowfreq: -6.3231 -4.1890 -1.3568 -0.0007 -0.0002 0.0007 13.9559 26.0801 31.6987
frequency: 13.8127 26.0090 31.6239 37.6662 40.4087 42.1163 50.0601 60.2336 62.8924 64.6234 74.8100 82.3188 89.3147 91.9871 102.3807 105.0291 110.0948 122.3540 123.1760 126.0259 141.2478 154.6778 173.2509 189.2578 201.2690 213.5786 219.2394 231.8892 243.8539 258.6884 282.1809 290.2716 311.6598 337.2460 343.5998 357.6914 362.2882 366.8865 387.8611 431.7364 438.7579 460.0890 470.4882 493.2090 508.6652 524.5238 557.8211 564.6294 567.6234 572.0145 578.3126 583.0459 604.1097 616.1828 628.2060 633.2018 640.2418 646.4689 655.1714 665.8546 684.1979 703.0234 734.3534 742.3579 768.7606 771.3845 781.9608 798.9374 831.0957 834.3773 858.0657 871.9519 907.2983 946.2688 947.1757 955.9939 961.3313 977.8447 989.6590 998.5296 999.4095 1005.1712 1011.2967 1025.4098 1029.1402 1041.1511 1043.6560 1045.6704 1047.4477 1048.5265 1086.2652 1087.6325 1097.6105 1154.6898 1165.8775 1178.4630 1196.6060 1200.3549 1219.4321 1232.6847 1252.4666 1272.3084 1290.6835 1297.2106 1301.9782 1310.1977 1336.7142 1349.6643 1354.6594 1362.0120 1370.8497 1382.7788 1383.5399 1389.1606 1391.5948 1397.0691 1431.7328 1446.3102 1451.3371 1453.7400 1454.0105 1454.8479 1457.1373 1457.6190 1458.0812 1463.7869 1470.4275 1522.1774 1540.3209 1564.4196 1603.8056 1609.3618 1622.5813 1640.5812 1656.3458 1661.9156 1667.5601 2961.1644 2996.7633 2999.3760 3004.0092 3004.2622 3048.0528 3065.9589 3076.7747 3088.1091 3088.7854 3092.0112 3099.9894 3100.8149 3118.6619 3128.6455 3130.5584 3142.0572 3142.7089 3400.6830 3498.3176 3508.0849 3652.6669
redmass: 5.2458 6.2570 8.0597 5.9192 6.3270 3.3261 3.1083 2.2584 2.2266 3.1026 3.7135 4.9175 6.8920 4.4827 2.9483 5.2792 1.8402 1.1903 1.0488 3.0917 5.2811 6.5614 6.4236 7.1509 6.8965 8.2072 5.6715 9.2002 6.5456 4.9301 3.3006 4.0848 5.2807 4.0230 3.9345 4.0207 4.4920 1.2966 3.7448 4.4957 4.4035 4.8588 5.8454 6.3710 5.4840 4.5249 3.4874 3.2191 4.0294 3.3426 3.8856 5.8702 1.4616 5.1573 4.4007 1.8844 4.6042 8.8936 2.8212 4.3219 6.2500 4.7933 1.5017 3.8633 5.4569 11.2248 5.0929 5.5731 6.1697 5.3834 4.6036 3.8354 6.1653 6.4886 5.8010 4.9678 4.5294 4.4914 2.2834 2.2133 2.2130 2.2668 2.4686 4.8412 2.5964 1.6582 1.8093 1.6612 1.7036 1.9003 2.2754 4.7579 2.3636 2.9417 3.0640 2.8209 3.3657 1.7626 2.5346 1.4386 1.3946 4.1644 1.6618 1.3918 1.2578 1.8340 1.3757 2.8368 1.5645 1.2672 7.7861 1.3446 1.2435 2.1696 1.3555 1.2070 1.8955 1.2862 1.0867 1.0763 1.4631 1.1050 1.0613 1.0578 1.0593 1.0594 1.1231 4.3712 3.4462 2.9349 2.6021 2.1318 7.2232 2.9732 9.2712 10.4219 10.4379 1.0909 1.0373 1.0379 1.0388 1.0384 1.0582 1.0861 1.0878 1.0982 1.0957 1.0871 1.0940 1.0934 1.0998 1.1022 1.1086 1.1026 1.1023 1.0820 1.0754 1.0456 1.1017
irintensity: 0.3840 0.8100 4.3093 3.7234 0.1207 6.0355 4.0833 3.3793 8.3409 7.5641 1.8723 1.6441 1.2976 0.6766 0.7394 2.3406 4.4794 1.2484 0.8813 4.5963 2.5757 3.5761 2.4070 14.4966 1.7123 5.7401 3.2401 1.9774 7.7676 8.4285 13.9094 1.0961 6.1816 7.4784 9.6374 16.1481 5.9786 80.1583 20.2790 4.2791 8.0312 4.5220 12.6739 3.2024 8.3546 1.5703 4.4918 3.6105 10.5497 4.7518 8.4437 21.8319 230.3699 10.7361 10.4607 31.2586 11.3181 3.9121 7.9726 22.3817 18.4330 60.5390 84.4147 18.6652 21.5711 11.7532 41.9644 60.0067 1.6777 18.0708 14.5676 37.6147 16.6087 5.4750 114.1616 86.6045 20.1117 50.1367 31.8945 45.6034 130.6088 105.2852 27.9750 119.7249 8.5966 25.0589 13.3124 6.0980 18.6546 9.1777 6.4847 37.7917 27.9019 9.6694 232.6758 321.8869 248.8191 43.2738 35.2286 24.5068 21.1645 37.0342 14.2601 14.5809 20.5231 24.8555 4.5135 31.7321 15.0859 3.5823 76.5241 172.1006 69.7112 136.2125 5.6413 66.2970 134.2741 68.6388 40.5372 4.3141 5.2421 10.7588 20.0964 18.3963 12.3258 18.9427 40.0555 139.7990 294.0602 281.5168 134.3180 76.0595 666.4089 237.9765 175.6691 245.2395 114.7981 148.2968 7.8191 3.4189 0.7005 1.9088 11.0449 4.0466 5.8110 13.7166 2.5842 2.8499 5.6360 6.2804 8.1924 1.4003 3.6869 6.2075 7.2595 448.2915 48.7827 60.4941 36.8228
temp: 298.150 k
press: 1.00000 atm
elementType: 8 8 8 8 8 8 8 8 8 7 7 7 7 7 7 6 6 6 6 6 6 6 6 6 6 6 6 6 6 6 6 6 6 1 1 1 1 1 1 1 1 1 1 1 1 1 1 1 1 1 1 1 1 1 1
symmnumber: 1
zpe: 1077981.5 jmol-1
zpe.correction: 0.410581 hartree
zpe.thermalcorrener: 0.444246 hartree
zpe.thermalcorrenthalpy: 0.445190 hartree
zpe.thermalcorrgfe: 0.341761 hartree
zpe.sumelectzpe: -1702.217972 hartree
zpe.sumelectthermal: -1702.184308 hartree
zpe.sumelectthermalent: -1702.183363 hartree
zpe.sumelectthermalfe: -1702.286793 hartree
dipole: -8.3044 -5.3444 2.8098
dipole: 10.2675
quadrupole: -224.5414 -171.6033 -196.2487
quadrupole: -47.6225 -10.5598 1.5940
quadrupole: -27.0769 25.8612 1.2157 -47.6225 -10.5598 1.5940
hfenergy: -1702.6285533 hartree
pointgroup: C01 [X(C18H22N6O9)]
dipole: 3.8802199 0.6870185 0.8886942 debye
polarizability: 323.4464632|-1.8123993|348.1561822|-10.4888371|2.6353226|168.5106062 unknown
InChI: InChI=1S/C18H22N6O9/c1-6(25)20-18-21-11-14(22-17(19)23-15(11)29)24(18)16-13(32-9(4)28)12(31-8(3)27)10(33-16)5-30-7(2)26/h10,12-13,16,20,22H,5,19H2,1-4H3
charge 0 multiplicity 1
55 atoms
O  0.492833 -0.021472 -1.484654
O  1.712281 1.671587 1.223567
O  1.179259 -1.893968 0.858739
O  4.259529 -0.067219 -1.123618
O  -0.118949 2.624015 2.306756
O  3.304633 -2.849712 0.990223
O  -5.673309 -1.262943 0.214424
O  4.220751 -1.791891 -2.69468
O  -0.213609 3.764658 -0.710343
N  -1.432891 0.699623 -0.284324
N  -3.690094 1.102541 -0.147406
N  -1.564164 -1.809254 -0.174767
N  -2.419354 3.073739 -0.251362
N  -3.819292 -2.692117 -0.059707
N  -1.962731 -4.137066 -0.209148
C  0.848769 0.519799 0.865035
C  1.804941 -0.604902 0.433172
C  0.012359 0.885684 -0.40867
C  1.831304 -0.527625 -1.106706
C  2.945367 0.402379 -1.636037
C  -2.093949 -0.532837 -0.181248
C  -2.477415 1.664261 -0.261065
C  -3.469953 -0.281375 -0.098691
C  1.066439 2.717811 1.927131
C  2.074347 -2.960449 1.153535
C  -4.432191 -1.392294 0.041715
C  -2.510328 -2.851561 -0.151745
C  1.992327 3.894407 2.083258
C  4.781415 -1.23039 -1.728053
C  1.327661 -4.151532 1.699538
C  -1.430275 4.027575 -0.437984
C  6.0315 -1.677171 -1.013966
C  -1.905465 5.462806 -0.254775
H  0.210602 0.250847 1.723122
H  2.805761 -0.520556 0.884739
H  0.180778 1.945877 -0.678887
H  1.936559 -1.519111 -1.575394
H  2.849547 1.428185 -1.249392
H  2.939841 0.392655 -2.738667
H  -0.563439 -1.985651 -0.014649
H  -3.366405 3.424786 -0.071073
H  1.701996 4.487791 2.963148
H  1.891565 4.526478 1.181152
H  3.041857 3.572163 2.161925
H  1.334794 -4.099909 2.804313
H  1.845074 -5.078068 1.405741
H  0.275382 -4.172378 1.373125
H  -1.137764 -4.308668 -0.785035
H  -2.658383 -4.882124 -0.15989
H  6.625927 -2.329614 -1.670262
H  5.728534 -2.250945 -0.118235
H  6.629028 -0.814411 -0.680439
H  -1.601374 5.81994 0.746284
H  -2.998238 5.582537 -0.34713
H  -1.408186 6.099772 -1.003138
