program: Gaussian 09
title: 000273861
version: EM64L-G09RevD.01
frameworkgroup: C1[X(C11H18O4)]
method: RPBEPBE
basis: SDD
operation: Freq
keyword: #pfreq=noraman
keyword: PBEPBE/SDD
title: #p freq=noraman PBEPBE/SDD
converged: YES YES NO NO
title: Mulliken charges:
elementType: O O O O C C C C C C C C C C C H H H H H H H H H H H H H H H H H H
charge: -0.307955 -0.305393 -0.420579 -0.229292 -0.009342 -0.058093 -0.463292 -0.459359 0.377024 -0.397294 -0.406638 -0.374018 -0.508066 -0.707374 0.202964 0.245276 0.200521 0.223047 0.199738 0.211007 0.234480 0.197565 0.205451 0.202431 0.206602 0.192244 0.193528 0.256074 0.253000 0.222199 0.233795 0.214829 0.374918
chargesum: 0.00000
title: Mulliken charges with hydrogens summed into heavy atoms:
elementType: O O O O C C C C C C C C C C C
charge: -0.307955 -0.305393 -0.045660 -0.229292 0.235935 0.142428 -0.040507 -0.013872 0.377024 0.005722 0.002396 0.011754 0.001007 -0.036551 0.202964
polarizability: 1.51539718e+02 6.41227238e+00 1.21339640e+02 4.25685674e+00 -1.95473747e-01 1.05188083e+02
1716.lowfreq: -5.1589 -0.0008 -0.0001 0.0003 6.9953 8.7852 19.0105 44.4737 65.0961
frequency: 13.6534 44.3859 64.3132 101.9429 109.3808 150.9316 181.3131 195.4908 216.5199 249.4128 293.0767 305.6898 316.8586 337.5172 353.8221 384.6892 437.0249 462.3434 498.6956 503.9657 513.6986 600.6589 617.9344 642.1486 664.1128 743.8977 762.3725 780.7378 813.3045 832.7176 850.2783 858.8399 897.3755 925.2155 932.3377 952.2752 955.9553 987.4841 1003.6039 1031.6067 1033.2187 1047.8860 1090.7705 1101.0442 1124.1707 1135.4688 1162.2733 1182.7555 1189.9019 1209.7716 1221.5536 1229.7242 1251.0063 1256.7368 1264.9547 1295.2170 1306.4242 1319.6366 1339.1469 1340.7247 1345.3414 1354.9985 1360.3284 1364.5026 1381.1102 1384.3922 1412.0196 1458.1204 1462.3140 1463.5093 1468.2275 1471.9035 1474.6942 1484.0071 1681.6818 2941.1970 2966.1874 2969.1782 2976.6346 2980.3523 2995.1192 2999.2623 3016.6701 3022.8650 3025.1991 3027.6777 3033.4404 3052.5597 3065.1066 3073.4012 3097.1371 3105.1625 3510.4035
redmass: 5.6363 5.5240 4.0754 2.6367 2.8016 4.8598 2.0106 1.0964 3.0302 4.1784 2.5975 3.3376 3.3280 3.3981 2.5890 2.9103 2.7023 3.0968 2.0190 2.3681 3.1823 4.1052 3.5241 1.4583 5.0972 1.9183 4.8074 2.4668 3.1666 1.6357 2.3698 2.4122 2.7511 2.4787 2.1484 1.9834 4.1593 3.5584 1.5124 2.3149 1.5737 2.0947 1.9627 2.3096 2.9774 3.3733 2.3689 1.4401 1.3138 1.2809 2.3012 1.2452 1.2688 1.9274 1.2168 1.2336 1.2041 1.2123 1.4199 1.3574 1.3513 1.4442 1.4283 2.0520 1.3051 1.5515 1.0846 1.0591 1.0517 1.0789 1.0892 1.0867 1.0847 1.0873 8.5263 1.0835 1.0608 1.0640 1.0622 1.0639 1.0355 1.0634 1.0609 1.0981 1.0867 1.0996 1.0961 1.1007 1.1027 1.0980 1.0998 1.1002 1.0639
irintensity: 0.1969 2.3093 0.4149 1.4082 0.5281 0.2742 0.9085 0.5336 2.4899 1.6791 0.4264 1.8578 0.4630 2.8205 0.1215 2.2347 5.7546 17.1370 11.0420 10.4506 40.3635 14.6258 11.8167 125.2908 6.7789 5.6086 9.8806 21.0153 13.3955 12.4139 2.8024 6.1462 4.1225 44.1077 18.7375 31.0850 2.7955 154.3938 12.5026 199.9976 1.6736 7.0120 25.8325 10.7992 67.5768 62.0590 1.9911 0.7604 0.7563 1.8793 85.6187 5.5518 12.3467 1.1353 1.1453 2.2252 10.4813 1.3111 0.2088 1.1851 0.0731 1.5991 4.4600 108.1148 16.3120 6.9314 28.0161 4.8495 6.5125 1.6826 8.1422 12.6757 14.0052 14.3479 232.5869 35.3345 35.1837 36.7419 21.3344 16.1096 14.6077 21.9261 7.2391 62.3094 44.7239 48.2008 29.2942 43.5502 62.1184 0.9560 20.3087 28.4981 19.8880
temp: 298.150 k
press: 1.00000 atm
elementType: 8 8 8 8 6 6 6 6 6 6 6 6 6 6 6 1 1 1 1 1 1 1 1 1 1 1 1 1 1 1 1 1 1
symmnumber: 1
zpe: 730407.9 jmol-1
zpe.correction: 0.278198 hartree
zpe.thermalcorrener: 0.293270 hartree
zpe.thermalcorrenthalpy: 0.294214 hartree
zpe.thermalcorrgfe: 0.235021 hartree
zpe.sumelectzpe: -729.671377 hartree
zpe.sumelectthermal: -729.656305 hartree
zpe.sumelectthermalent: -729.655360 hartree
zpe.sumelectthermalfe: -729.714553 hartree
dipole: -0.5999 0.1345 0.2332
dipole: 0.6575
quadrupole: -81.6719 -85.5315 -93.0319
quadrupole: -1.4093 -1.3566 2.1481
quadrupole: 5.0732 1.2136 -6.2868 -1.4093 -1.3566 2.1481
hfenergy: -729.9495745 hartree
pointgroup: C01 [X(C11H18O4)]
dipole: 0.2340773 -0.0817512 0.073812 debye
polarizability: 151.9661391|4.0110178|120.2156575|-6.1445096|1.6899318|105.8856435 unknown
InChI: InChI=1S/C11H18O4/c1-11(7-10(12)13)14-8-5-3-2-4-6-9(8)15-11/h8-9,12H,2-7H2,1H3
charge 0 multiplicity 1
33 atoms
O  -0.628757 -0.950526 -0.930933
O  -0.580705 -0.355972 1.366949
O  -3.737064 2.01678 0.042008
O  -1.467956 1.968583 -0.415264
C  0.665907 -0.255777 -0.667026
C  0.819849 -0.368395 0.866254
C  1.775197 -0.968546 -1.446422
C  1.592397 0.767604 1.548592
C  -1.420326 -0.968562 0.320489
C  3.141409 -0.240252 -1.36742
C  2.885642 1.199876 0.796125
C  3.671668 0.076796 0.058939
C  -2.702654 -0.126705 0.186656
C  -1.739041 -2.433711 0.654644
C  -2.50282 1.350734 -0.094524
H  0.555881 0.801327 -0.970926
H  1.270843 -1.355914 1.106781
H  1.467516 -1.049984 -2.506119
H  1.869778 -2.003121 -1.059845
H  1.841517 0.452294 2.578982
H  0.908242 1.632248 1.629668
H  3.077697 0.715063 -1.928682
H  3.888055 -0.8630 -1.89871
H  3.553931 1.688195 1.53121
H  2.632883 1.979775 0.050268
H  3.697226 -0.846842 0.673387
H  4.725052 0.404418 -0.044065
H  -3.322187 -0.542439 -0.630273
H  -3.301906 -0.213492 1.110547
H  -2.294602 -2.9064 -0.174342
H  -0.797965 -2.989249 0.801116
H  -2.339246 -2.503104 1.578575
H  -3.605662 2.982598 -0.162837
