program: Gaussian 09
title: 000026326
version: EM64L-G09RevD.01
frameworkgroup: C1[X(C10H24N2)]
method: RPBEPBE
basis: SDD
operation: Freq
keyword: #pfreq=noraman
keyword: PBEPBE/SDD
title: #p freq=noraman PBEPBE/SDD
converged: YES YES NO NO
title: Mulliken charges:
elementType: N N C C C C C C C C C C H H H H H H H H H H H H H H H H H H H H H H H H
charge: -0.298669 -0.298620 -0.390838 -0.390993 -0.361621 -0.361242 -0.019943 -0.020107 -0.680144 -0.714587 -0.680709 -0.714262 0.174047 0.214282 0.173979 0.214193 0.208036 0.170045 0.169893 0.208179 0.175045 0.175107 0.239936 0.239930 0.203027 0.223330 0.217375 0.203410 0.210839 0.226463 0.203135 0.223367 0.217609 0.203315 0.210711 0.226483
chargesum: 0.00000
title: Mulliken charges with hydrogens summed into heavy atoms:
elementType: N N C C C C C C C C C C
charge: -0.058733 -0.058691 -0.002508 -0.002821 0.016459 0.016830 0.155102 0.155000 -0.036413 -0.073875 -0.036598 -0.073753
polarizability: 1.62514369e+02 4.50949769e-01 1.12916433e+02 1.14339598e-02 4.14542545e-03 1.06134682e+02
1716.lowfreq: -3.2810 -0.0007 -0.0004 0.0004 4.7871 12.3837 18.1546 25.9617 47.3826
frequency: 18.0068 25.9518 47.3749 66.8479 82.7553 113.8540 120.6065 129.1591 150.4179 191.3712 198.8717 199.2519 229.4253 239.7322 246.5575 335.4387 349.4950 386.3415 418.5338 448.0165 458.6243 504.1798 509.5669 656.2350 662.0791 748.3549 807.4146 818.2766 827.4880 918.6058 918.7982 925.0339 946.9675 947.1011 959.1690 960.0849 1021.0932 1051.6674 1075.4925 1091.3132 1093.6287 1105.1032 1134.5554 1157.1314 1161.9935 1163.4624 1181.6144 1193.0053 1199.1182 1245.3751 1248.9022 1280.1599 1282.9335 1302.8906 1317.8643 1335.5491 1337.5083 1338.7596 1368.3575 1371.1498 1378.4797 1380.4278 1388.6005 1388.8287 1449.6698 1450.1336 1465.6193 1465.6308 1469.4104 1469.6305 1470.4293 1476.4267 1479.0019 1479.1767 1488.0217 1488.6915 1496.6989 1499.9934 2829.2861 2829.4588 2836.9878 2837.6564 2955.3551 2957.4618 2972.5306 2972.6920 2981.1670 2981.2238 3006.7675 3008.0584 3022.1169 3047.5924 3064.3007 3064.4970 3076.5694 3076.7720 3083.7398 3083.7606 3090.0208 3090.1552 3410.6194 3410.8430
redmass: 2.4312 3.3021 3.5256 2.9140 1.6952 2.0418 2.3087 2.7590 1.7421 2.7879 1.2653 1.2397 1.6392 1.1132 1.6121 2.4069 2.9079 2.2174 2.3680 2.7128 2.1699 2.7226 2.4886 1.4361 1.4785 1.0754 1.1701 2.4975 2.4641 1.1706 1.1683 1.4006 1.4083 1.4060 1.9254 1.7030 4.1148 3.2497 2.5070 2.3715 2.4267 1.6384 1.7024 2.1824 1.9625 1.9309 2.0512 2.1189 1.8086 1.2504 1.2930 1.0520 1.1555 1.2419 1.3594 1.4827 1.3694 1.3643 1.2984 1.3142 1.3564 1.4909 1.2161 1.2166 1.1308 1.1262 1.0663 1.0669 1.0799 1.0782 1.0675 1.0862 1.1044 1.1008 1.0573 1.0583 1.0866 1.0913 1.0802 1.0804 1.0732 1.0727 1.0624 1.0667 1.0364 1.0364 1.0357 1.0357 1.0848 1.0823 1.0952 1.1014 1.0980 1.0980 1.0989 1.0989 1.1003 1.1004 1.0997 1.0997 1.0739 1.0739
irintensity: 0.0395 0.0367 0.1723 0.9963 2.2483 1.4884 0.6206 0.4860 1.9730 0.0005 0.2977 0.2687 1.5778 0.3012 0.3374 0.5872 0.8303 0.0543 25.1184 1.7027 0.2375 0.5436 9.7527 142.5078 24.3417 6.2992 0.2037 2.3875 5.6495 5.0498 2.4719 0.2325 0.2647 1.2050 1.2250 0.0608 2.6497 0.1296 1.1160 2.6611 14.5982 7.0460 1.3099 43.5668 19.6313 3.6580 0.1611 76.1711 4.0142 19.7716 9.1316 2.4408 0.8559 0.2213 35.5066 0.5157 71.1682 3.4280 13.5574 16.5636 15.6996 4.8326 28.1532 21.9434 28.1075 17.3753 3.5047 4.3499 0.1833 7.3347 0.1687 3.9295 4.1051 16.1481 4.6790 13.0601 0.4620 16.7849 37.4673 45.8363 152.2517 190.4221 9.1474 50.5031 43.3862 34.7869 20.3287 15.2913 18.4691 41.3494 0.3719 105.0114 35.7607 48.8997 74.2742 17.2691 24.3116 4.3793 73.8921 64.2430 3.6098 4.2718
temp: 298.150 k
press: 1.00000 atm
elementType: 7 7 6 6 6 6 6 6 6 6 6 6 1 1 1 1 1 1 1 1 1 1 1 1 1 1 1 1 1 1 1 1 1 1 1 1
symmnumber: 1
zpe: 864296.7 jmol-1
zpe.correction: 0.329193 hartree
zpe.thermalcorrener: 0.345902 hartree
zpe.thermalcorrenthalpy: 0.346847 hartree
zpe.thermalcorrgfe: 0.283055 hartree
zpe.sumelectzpe: -503.910397 hartree
zpe.sumelectthermal: -503.893688 hartree
zpe.sumelectthermalent: -503.892744 hartree
zpe.sumelectthermalfe: -503.956535 hartree
dipole: 0.0039 0.0003 -1.9076
dipole: 1.9076
quadrupole: -76.3889 -79.1981 -78.5173
quadrupole: -2.2691 -0.0059 -0.0008
quadrupole: 1.6459 -1.1633 -0.4825 -2.2691 -0.0059 -0.0008
hfenergy: -504.2395904 hartree
pointgroup: C01 [X(C10H24N2)]
dipole: -0.0013079 -0.0078714 0.7504558 debye
polarizability: 162.515595|0.3777193|112.9145311|-0.0023782|0.0679046|106.1353585 unknown
InChI: InChI=1S/C10H24N2/c1-9(2)11-7-5-6-8-12-10(3)4/h9-12H,5-8H2,1-4H3
charge 0 multiplicity 1
36 atoms
N  -3.133105 0.421994 0.099394
N  3.131928 -0.422032 0.087839
C  -0.645396 0.425205 0.111041
C  0.64459 -0.423633 0.103786
C  -1.925351 -0.433567 0.096856
C  1.924976 0.434528 0.101648
C  -4.438127 -0.284409 0.203787
C  4.437902 0.279991 0.208374
C  -4.740134 -1.066839 -1.093754
C  -5.541052 0.757024 0.483851
C  4.739649 1.094504 -1.069388
C  5.539585 -0.76969 0.460863
H  -0.651666 1.079541 1.00967
H  -0.663385 1.097157 -0.769187
H  0.651639 -1.091796 0.992199
H  0.661334 -1.081967 -0.786731
H  -1.929818 -1.053672 -0.819962
H  -1.902341 -1.144814 0.964293
H  1.903884 1.131162 0.980964
H  1.928288 1.069967 -0.804623
H  -4.428082 -1.019592 1.051369
H  4.429799 0.993845 1.07403
H  -3.057419 1.145535 0.830244
H  3.054424 -1.160753 0.803119
H  -5.730282 -1.55458 -1.02883
H  -4.737153 -0.374647 -1.955049
H  -3.989943 -1.855668 -1.282438
H  -5.346687 1.306583 1.425697
H  -6.527536 0.26858 0.575247
H  -5.58537 1.491471 -0.340885
H  5.731778 1.576755 -0.994336
H  4.732044 0.424825 -1.94828
H  3.992195 1.890905 -1.235977
H  5.34446 -1.343432 1.388001
H  6.526724 -0.285128 0.564941
H  5.582646 -1.482255 -0.382876
