program: Gaussian 09
title: 000273838
version: EM64L-G09RevD.01
frameworkgroup: C1[X(C9H14O3)]
method: RPBEPBE
basis: SDD
operation: Freq
keyword: #pfreq=noraman
keyword: PBEPBE/SDD
title: #p freq=noraman PBEPBE/SDD
converged: YES YES NO NO
title: Mulliken charges:
elementType: O O O C C C C C C C C C H H H H H H H H H H H H H H
charge: -0.241582 -0.419208 -0.230739 -0.080716 -0.080803 -0.129635 -0.472350 -0.472300 -0.408830 -0.409060 -0.435573 0.137378 0.220392 0.220443 0.259705 0.209332 0.245552 0.245621 0.209379 0.213636 0.199430 0.199463 0.213625 0.211339 0.218386 0.377116
chargesum: 0.00000
title: Mulliken charges with hydrogens summed into heavy atoms:
elementType: O O O C C C C C C C C C
charge: -0.241582 -0.042092 -0.230739 0.139675 0.139640 0.130070 -0.017466 -0.017300 0.004236 0.004028 -0.005849 0.137378
polarizability: 1.12153832e+02 1.29897070e-02 9.24643200e+01 -9.44993348e-01 -2.60722597e-02 9.18062389e+01
1716.lowfreq: -22.2801 0.0003 0.0005 0.0008 7.5759 17.3419 25.9043 94.9204 128.3399
frequency: -21.5982 94.7807 128.2626 161.2463 242.9111 256.0178 302.0782 320.5641 376.5569 396.8540 426.9523 484.4864 526.3530 591.7750 614.3839 665.1822 708.2538 715.8242 741.9384 794.5745 815.2950 827.0985 843.8670 878.2962 921.6147 953.6703 963.7159 974.2607 995.0661 1026.3532 1052.6686 1080.9783 1093.5075 1102.2232 1119.3983 1168.4144 1195.0812 1215.4801 1233.4813 1259.0433 1266.5187 1279.1798 1303.4908 1304.1751 1311.7875 1335.1792 1337.6892 1352.5906 1355.9244 1358.5709 1363.5688 1372.9699 1443.4900 1453.1622 1454.5614 1462.3984 1499.7755 1662.8448 2980.3754 2982.4693 2990.6977 2991.9746 3001.1149 3029.2726 3029.6408 3034.2943 3039.0954 3048.1639 3055.1353 3059.7752 3083.5351 3498.3747
redmass: 7.5889 4.4485 2.3069 4.2659 6.6967 2.2331 4.2222 1.9071 2.0782 3.4696 3.9519 4.3879 2.0588 3.6596 1.4260 4.8708 3.1073 2.6033 3.8487 3.1316 3.2097 1.4703 2.9352 1.7712 3.2441 2.1181 2.2052 1.9680 2.9719 3.8225 2.0887 1.6826 1.7170 1.6624 2.1442 1.3153 1.2405 1.8655 1.4051 1.2170 1.2814 1.5355 1.9317 1.2675 1.1961 1.5135 1.3554 1.3195 1.3248 1.3955 1.3881 1.5705 1.0821 1.0864 1.0865 1.0848 1.0857 8.0182 1.0607 1.0602 1.0597 1.0611 1.0633 1.0873 1.0985 1.0884 1.1020 1.0964 1.1027 1.1011 1.0904 1.0637
irintensity: 1.3620 0.1457 0.0362 0.0368 1.8998 3.4907 2.9671 0.0777 1.8046 0.0827 15.8486 21.3713 3.3078 23.7195 96.3616 1.3445 55.8280 3.4515 4.9499 5.0489 7.3287 0.0109 0.6678 1.3349 9.2295 6.7636 12.2370 11.1338 56.3240 69.5764 231.0208 0.4349 0.0343 26.7421 4.3435 1.8645 20.4579 0.1234 4.2944 1.6842 13.3129 0.1807 44.4590 3.2892 0.0056 28.8754 0.2217 0.3034 1.6702 0.0344 4.5111 31.9580 0.1094 25.7544 18.6920 1.0584 13.6167 196.2471 12.6125 36.7468 30.8439 5.7327 51.8996 97.8515 32.6367 11.5482 3.4431 10.5528 9.5710 81.7251 39.9204 18.2933
temp: 298.150 k
press: 1.00000 atm
elementType: 8 8 8 6 6 6 6 6 6 6 6 6 1 1 1 1 1 1 1 1 1 1 1 1 1 1
symmnumber: 1
zpe: 580250.5 jmol-1
zpe.correction: 0.221006 hartree
zpe.thermalcorrener: 0.230764 hartree
zpe.thermalcorrenthalpy: 0.231708 hartree
zpe.thermalcorrgfe: 0.186156 hartree
zpe.sumelectzpe: -576.085650 hartree
zpe.sumelectthermal: -576.075893 hartree
zpe.sumelectthermalent: -576.074948 hartree
zpe.sumelectthermalfe: -576.120500 hartree
dipole: -0.5155 -0.0484 2.8970
dipole: 2.9429
quadrupole: -71.0051 -66.6831 -78.8271
quadrupole: -0.0610 2.6823 0.1960
quadrupole: 1.1667 5.4887 -6.6554 -0.0610 2.6823 0.1960
hfenergy: -576.3066562 hartree
pointgroup: C01 [X(C9H14O3)]
dipole: 0.2157795 0.3351707 1.0870267 debye
dipolederiv: -0.5775005 -0.017956 -0.0473201 -0.020778 -0.749599 0.0936382 -0.0569148 0.0936822 -0.4807081 -0.5442354 0.1446531 0.4516591 0.1337489 -0.4499484 -0.184369 0.4165795 -0.1835034 -0.949724 -0.827896 -0.0718322 -0.258879 -0.0090549 -0.3617121 -0.1397013 -0.0598675 -0.1436424 -0.7784134 0.4975235 0.0820799 0.0319534 0.1012879 0.406498 -0.0986893 0.0640441 -0.2280892 0.4099329 0.4918647 -0.0492319 0.0754004 -0.0450659 0.563151 -0.0071859 0.1169473 0.1203813 0.2581963 -0.3764556 0.024553 0.0569207 0.0409438 0.0105368 0.0145198 0.1116302 0.0135899 0.0564518 -0.1242092 -0.0019151 0.0239823 -0.1203902 0.1077846 -0.0073079 -0.053668 0.0340897 0.0579862 -0.1200648 0.0225559 0.0158089 0.0758052 0.0765345 -0.0073737 -0.1171438 -0.0448041 0.0857364 0.031621 -0.0493741 -0.0725865 -0.0384343 0.0412546 -0.0374849 -0.0538458 0.004786 -0.0193684 0.0343033 0.0007962 -0.087163 0.0013602 0.0363398 0.0015346 -0.0664455 -0.0408833 -0.0170553 0.1324581 -0.015488 -0.043848 -0.0140124 0.0268335 0.0085472 -0.0395087 0.008156 0.0489228 1.4387521 -0.0664327 -0.1358033 -0.09912 0.265663 0.3712278 -0.2394686 0.3732254 1.3217344 -0.0142095 0.0501811 0.0093445 0.0360337 -0.1535147 -0.0548104 0.0129295 -0.0777984 0.012025 -0.017192 -0.0382173 0.0403909 -0.0241618 -0.0365645 0.0880205 0.0358559 0.1110822 -0.1020791 0.1027013 -0.0113125 -0.031822 -0.0143807 0.0146946 -0.0347071 -0.0416415 -0.0344674 -0.0875165 0.0540856 -0.0325577 0.049407 -0.0096885 -0.0488835 0.0894864 0.060568 0.1418245 -0.0481953 0.0119326 -0.0247987 -0.0753097 -0.0032309 0.0498074 -0.0270662 -0.0744013 -0.0826953 -0.0358348 0.0114849 -0.0205231 -0.0767267 -0.0371665 0.0754905 -0.0464379 -0.0619266 0.0090223 -0.0611598 0.056331 0.0486 0.021582 0.0356456 -0.1599444 -0.0147063 0.0419323 -0.067636 0.0605115 -0.1685048 0.0674699 0.0201003 0.0227392 0.0375245 -0.0298883 0.053263 -0.0549781 0.0520988 0.075955 -0.0572864 0.0518435 -0.0271698 -0.0681828 0.1091236 0.0142188 0.1387816 -0.0809271 0.0789066 0.0691751 0.0098341 0.0227994 -0.1904063 -0.035939 -0.0050785 -0.0648163 0.0387914 -0.1706415 -0.0370277 0.0527996 0.0187296 0.0824228 0.0081785 0.0556481 0.0326226 0.0091012 -0.0842128 0.0482541 0.1508768 0.0430456 0.0048478 -0.0013745 0.1341957 -0.0009857 0.0104828 -0.0947769 -0.0482077 -0.1640461 -0.0370709 0.0426581 -0.0303134 -0.1278044 -0.0309011 -0.0556198 0.1019793 -0.0161575 -0.0683993 -0.0324145 0.3767142 -0.0269216 -0.1200975 -0.026043 0.2946303 unknown
polarizability: 112.1660343|-0.1348454|92.4231246|0.7892011|-0.1741286|91.835232 unknown
InChI: InChI=1S/C9H14O3/c10-9(11)6-4-7-2-1-3-8(5-6)12-7/h6-8,10H,1-5H2
charge 0 multiplicity 1
26 atoms
O  1.51973 -0.426343 -1.398914
O  -3.020991 0.512881 1.337891
O  -3.101154 -0.18047 -0.875175
C  1.169574 -1.348949 -0.288958
C  1.212367 0.973519 -1.0091
C  -0.90247 0.125222 0.23001
C  -0.359897 -1.309716 -0.046547
C  -0.314706 1.129625 -0.806862
C  2.079829 -1.056565 0.930032
C  2.122602 1.392355 0.172455
C  2.051357 0.426278 1.384819
C  -2.418833 0.121807 0.12868
H  1.424287 -2.346501 -0.690694
H  1.498339 1.559394 -1.901585
H  -0.650733 0.440258 1.253797
H  -0.624472 -1.98575 0.789287
H  -0.854488 -1.693399 -0.958669
H  -0.803744 0.942563 -1.781296
H  -0.548643 2.169233 -0.506554
H  3.112877 -1.316581 0.627599
H  1.808713 -1.726413 1.769542
H  1.878911 2.426843 0.484606
H  3.161115 1.405319 -0.211619
H  1.147404 0.628223 1.986609
H  2.90998 0.61917 2.055654
H  -4.011554 0.496799 1.227894
