program: Gaussian 09
title: 000273835
version: EM64L-G09RevD.01
frameworkgroup: C1[X(C9H13N3O)]
method: RPBEPBE
basis: SDD
operation: Freq
keyword: #p
keyword: freq=noraman
keyword: PBEPBE/SDD
title: #p freq=noraman PBEPBE/SDD
converged: YES YES NO NO
title: Mulliken charges:
elementType: O N N N C C C C C C C C C H H H H H H H H H H H H H
charge: -0.253699 0.044621 -0.396710 -0.654902 0.186571 0.155328 -0.538458 -0.500397 -0.441735 -0.543765 -0.538992 -0.045166 0.288813 0.228287 0.228338 0.240502 0.240711 0.223552 0.223771 0.233364 0.233370 0.231398 0.231224 0.285693 0.342282 0.295996
chargesum: 0.00000
title: Mulliken charges with hydrogens summed into heavy atoms:
elementType: O N N N C C C C C C C C C
charge: -0.253699 0.044621 -0.111016 -0.016625 0.186571 0.155328 -0.081832 -0.019184 0.005589 -0.077031 -0.076369 -0.045166 0.288813
polarizability: 2.08809562e+02 -1.01030054e+01 1.24231701e+02 -7.17936094e-03 -1.90361038e-02 6.90894138e+01
1716.lowfreq: -84.0851 -0.0008 -0.0007 -0.0006 5.6825 10.1619 16.0756 30.5822 58.5337
frequency: -84.0839 30.5350 58.5243 81.9476 120.9772 142.8241 197.0053 227.2114 243.5273 254.6500 330.8330 418.8347 436.0893 477.5872 498.8974 534.7875 548.7103 562.6474 604.6013 684.5424 705.4004 708.6415 734.0335 779.8506 811.4980 888.4089 897.8072 915.1928 965.7730 977.5832 977.9364 1010.3978 1035.0978 1038.8725 1058.5696 1106.7386 1118.1882 1149.7435 1183.1971 1183.4838 1205.4703 1231.0812 1237.3465 1251.7673 1280.6408 1290.5019 1293.2017 1338.8141 1413.8925 1444.8274 1457.0108 1464.9790 1469.3257 1483.2908 1502.5110 1600.3216 1602.3089 1653.8879 1679.3796 2962.5504 2967.0187 2981.5630 2997.9798 3000.0340 3008.5674 3021.3770 3030.8285 3040.9180 3080.3229 3408.4941 3537.8152 3697.5115
redmass: 1.5864 3.8862 3.8089 4.8471 1.9740 3.4957 2.1865 5.3405 1.3885 6.0006 3.1945 3.4706 1.9669 1.2626 3.6459 1.6361 5.2894 2.0592 5.5204 5.3164 6.2929 8.5591 1.1356 5.4123 1.3584 3.0639 1.4190 3.1307 4.1880 3.3869 1.6209 3.2837 2.6010 1.8346 5.0366 4.1065 1.1280 1.2770 1.2313 1.4049 1.1168 1.0746 1.3647 1.5843 1.6244 2.2670 1.5509 3.4970 4.3791 1.1049 1.0908 1.1039 1.0821 1.1008 1.9515 1.7150 3.0949 7.3878 5.3724 1.0591 1.0580 1.0610 1.0599 1.1015 1.1024 1.0619 1.1023 1.1027 1.1047 1.0749 1.0459 1.1034
irintensity: 0.1999 16.3143 1.8147 7.5146 1.6470 0.0423 2.3258 1.8636 22.3076 0.2301 9.1247 0.8980 179.5554 129.2173 16.2620 74.6350 6.7271 32.8332 1.3416 0.1270 5.2252 17.2017 7.6745 0.3448 4.2540 1.6269 0.0922 0.2766 1.0528 3.6616 0.0013 10.4922 23.1334 0.0543 46.3975 160.5264 0.0635 0.2618 0.9146 2.8768 0.0030 0.1086 8.1769 4.7263 42.4192 306.4678 153.2501 7.1005 27.4093 40.8938 2.7949 14.3809 8.8388 10.6320 384.7457 91.1797 72.3004 23.6104 327.1033 37.1583 43.5922 68.8941 22.1197 16.7677 0.4389 71.7888 40.7334 4.1193 49.9584 14.8352 47.9066 43.5277
temp: 298.150 k
press: 1.00000 atm
elementType: 8 7 7 7 6 6 6 6 6 6 6 6 6 1 1 1 1 1 1 1 1 1 1 1 1 1
symmnumber: 1
zpe: 558277.4 jmol-1
zpe.correction: 0.212637 hartree
zpe.thermalcorrener: 0.224760 hartree
zpe.thermalcorrenthalpy: 0.225704 hartree
zpe.thermalcorrgfe: 0.173245 hartree
zpe.sumelectzpe: -589.233301 hartree
zpe.sumelectthermal: -589.221178 hartree
zpe.sumelectthermalent: -589.220234 hartree
zpe.sumelectthermalfe: -589.272693 hartree
dipole: -1.5325 6.2742 -0.0131
dipole: 6.4586
quadrupole: -63.0401 -76.1649 -77.9929
quadrupole: 18.0980 -0.0544 -0.0031
quadrupole: 9.3592 -3.7656 -5.5936 18.0980 -0.0544 -0.0031
hfenergy: -589.4459379 hartree
pointgroup: C01 [X(C9H13N3O1)]
dipole: -0.5913421 -2.4710887 -0.0287974 debye
dipolederiv: -0.793648 -0.1342642 -0.0018333 -0.473619 -1.1028342 -0.0082594 -0.0067328 -0.0082836 -0.3713932 0.7305358 0.0644228 0.0004873 -0.8449313 -0.3736863 -0.0035589 -0.0129625 -0.0040124 -0.1022911 -2.0528255 -0.4503826 -0.0058368 -0.0288032 -0.1515334 0.003843 0.0013847 0.0037177 -0.3572054 -1.4145661 0.3225417 0.0030947 0.575239 -0.5021623 0.001371 0.0069294 0.001368 -0.7955544 0.2101889 -0.0618198 -0.001166 0.2567999 0.1244031 0.0040132 0.0016539 0.0037633 -0.1628007 -0.2868307 -0.035207 -0.0003617 -0.2233446 0.089468 0.0029379 -0.0032661 0.0034858 -0.0935684 -0.0296935 0.0655645 0.0012146 -0.0340565 -0.0706845 -0.0036971 0.0009588 -0.0035639 0.2011573 -0.0063813 0.0185546 0.0002596 0.0176776 -0.0269816 -0.0032512 0.0002539 -0.003303 0.1867493 0.0510003 -0.0529641 -0.0012384 -0.0755965 0.0485289 -0.0010133 -0.000694 -0.0018032 0.1508347 -0.082891 0.0378459 0.0006858 0.0575602 0.0242217 -0.002898 0.0011776 -0.0027149 0.2175826 -0.0441839 0.0143364 0.0004342 -0.0346549 -0.1855274 -0.0058625 -0.0001934 -0.0058612 0.2013044 0.3645165 0.0549519 0.0005325 0.0568817 0.3422596 0.0053932 0.001361 0.0054076 -0.0182684 2.9090685 0.1302109 0.0023508 0.672418 1.6190204 0.0145664 0.0102499 0.0148779 0.3385755 -0.0894556 -0.0498463 -0.0845426 0.0090421 0.0337793 -0.0607104 -0.1789597 -0.0714146 -0.0591093 -0.0888639 -0.0516889 0.0830086 0.0051848 0.0302436 0.0631109 0.1790124 0.0739974 -0.0568977 0.0325167 -0.0189643 -0.054535 -0.0159402 -0.0113126 -0.0712654 -0.0380504 -0.1207416 -0.0463735 0.0325546 -0.0215555 0.0540194 -0.0173728 -0.0173563 0.0721758 0.037493 0.1214498 -0.0391136 -0.0091092 0.054044 0.0750726 0.0640324 0.0023368 -0.0719513 0.1303772 -0.1106799 -0.0673991 -0.0073906 0.0544837 -0.0730485 0.0657138 -0.0015383 0.0733447 -0.1284619 0.1124187 -0.0646086 0.0456474 -0.0198463 0.0513049 -0.0820216 -0.0418086 0.0780384 0.0877646 0.1482447 -0.0447631 0.0453904 -0.0186005 -0.0519484 -0.0794889 -0.0351919 -0.0776929 -0.0901438 -0.1478965 -0.0511509 0.0200566 0.0586849 0.0850681 0.023933 0.01016 -0.0492434 0.0774986 -0.089564 -0.0448975 0.0196384 0.0614536 -0.083476 0.0263845 0.0058507 0.0508071 -0.0769532 0.0910746 -0.0404247 -0.0106511 0.006464 0.0004528 0.0991802 -0.0417609 -0.0050575 0.0009176 -0.0050833 0.3124268 0.2409424 -0.0054641 -0.0000945 0.011865 0.1702993 -0.0022227 0.000172 -0.0022562 0.4035558 0.2144339 -0.0229556 0.0000953 -0.0320828 0.0618071 -0.0029176 -0.0007866 -0.0026272 0.403633 unknown
polarizability: 208.713008|10.4986764|124.3183006|0.0827801|0.7408261|69.0993681 unknown
InChI: InChI=1S/C9H13N3O/c10-9(13)12-11-8-5-4-6-2-1-3-7(6)8/h12H,1-5,10H2
charge 0 multiplicity 1
26 atoms
O  3.594925 1.613103 0.029005
N  1.054592 0.371852 0.017388
N  2.250993 -0.337471 0.006365
N  4.585449 -0.498679 0.004953
C  -2.361729 -0.689167 0.003485
C  -1.384281 0.265678 0.017081
C  -3.751384 -0.101509 0.013555
C  -1.922126 1.674559 0.038952
C  -3.485515 1.455673 0.031984
C  -1.806298 -2.098099 -0.017396
C  -0.249783 -1.87307 -0.01532
C  -0.059105 -0.337991 0.007559
C  3.479579 0.361688 0.014769
H  -4.34013 -0.409231 -0.874329
H  -4.335906 -0.431045 0.896431
H  -1.578806 2.226984 0.933185
H  -1.57509 2.256617 -0.834742
H  -3.946938 1.91637 0.922773
H  -3.940956 1.935604 -0.851709
H  -2.133976 -2.688799 0.860497
H  -2.135306 -2.662933 -0.911679
H  0.218325 -2.32095 -0.914988
H  0.219842 -2.348112 0.8695
H  2.252537 -1.366017 -0.008417
H  5.500363 -0.055763 0.009011
H  4.528427 -1.514892 -0.003015
