program: Gaussian 09
title: 000273829
version: EM64L-G09RevD.01
frameworkgroup: C1[X(C8H12O3)]
method: RPBEPBE
basis: SDD
operation: Freq
keyword: #pfreq=noraman
keyword: PBEPBE/SDD
title: #p freq=noraman PBEPBE/SDD
converged: YES YES NO NO
title: Mulliken charges:
elementType: O O O C C C C C C C C H H H H H H H H H H H H
charge: -0.249730 -0.425477 -0.221732 -0.092525 -0.093200 -0.120803 -0.460176 -0.476863 -0.454784 -0.455026 0.130092 0.233928 0.233865 0.258990 0.230592 0.232221 0.252785 0.213668 0.235412 0.208964 0.207318 0.233967 0.378512
chargesum: 0.00000
title: Mulliken charges with hydrogens summed into heavy atoms:
elementType: O O O C C C C C C C C
charge: -0.249730 -0.046965 -0.221732 0.141403 0.140666 0.138188 0.002637 -0.010410 -0.010408 -0.013741 0.130092
polarizability: 9.96814685e+01 -8.44320689e-01 8.93629385e+01 2.25642151e+00 -6.47952075e-01 7.37732719e+01
1716.lowfreq: -39.7430 -19.5250 -14.3052 -0.0009 -0.0005 -0.0003 25.9172 93.1824 156.1866
frequency: 22.2272 93.0496 156.1798 167.3635 256.3231 313.8221 315.7994 389.8112 460.2290 466.8882 521.9406 581.7624 600.1682 690.6095 727.8103 739.6719 782.6601 797.4851 818.1634 851.2005 858.8676 905.0981 935.4164 952.0310 982.1980 989.0250 1020.6158 1033.9255 1060.7626 1085.3493 1133.6991 1151.0867 1154.6038 1202.9964 1210.9026 1238.8082 1249.2966 1253.2685 1266.3774 1285.6070 1295.3846 1299.3899 1316.7868 1333.7679 1342.5491 1364.0474 1446.7012 1458.3021 1464.3330 1482.0902 1662.0991 2996.3747 3002.1797 3003.1162 3009.4375 3022.9629 3060.8622 3067.0136 3069.8853 3073.4580 3075.2761 3093.2907 3512.2145
redmass: 8.3648 3.9518 2.0480 3.8532 6.0848 1.9645 3.4946 2.2763 4.9106 3.8028 2.9519 1.9227 2.0470 3.5381 4.4805 4.7804 1.5415 4.1020 2.7820 2.6589 1.5775 3.4516 3.2473 3.6210 1.9860 2.1566 2.1803 2.1524 1.8276 2.0486 2.2910 1.1721 1.2553 1.3582 1.1654 1.4564 1.3498 1.3395 1.6967 1.4068 1.3536 1.5676 1.4735 1.3656 1.4162 1.6448 1.0847 1.0893 1.0808 1.0963 8.6744 1.0781 1.0631 1.0625 1.0597 1.0631 1.0961 1.1014 1.0967 1.0990 1.0946 1.1031 1.0640
irintensity: 0.4555 0.2403 0.2677 0.7403 1.6165 0.4978 4.8157 0.7659 35.4210 0.5295 9.7972 70.1350 56.2635 44.1065 7.7349 2.7202 5.8982 9.4790 1.3309 9.4527 0.7450 3.9374 8.0723 22.8334 15.3623 2.8058 159.5921 22.7419 77.7031 44.1057 7.3279 1.2585 2.1483 22.4078 6.9406 3.7394 2.9496 6.1039 0.8223 9.1430 21.6763 45.9001 1.4881 5.7767 6.8112 7.3096 7.0912 17.0278 7.0352 14.5452 227.2223 8.4856 21.0530 10.2971 33.1905 36.3474 21.0676 31.9816 19.8107 17.1300 22.2562 71.3817 21.1868
temp: 298.150 k
press: 1.00000 atm
elementType: 8 8 8 6 6 6 6 6 6 6 6 1 1 1 1 1 1 1 1 1 1 1 1
symmnumber: 1
zpe: 503476.1 jmol-1
zpe.correction: 0.191764 hartree
zpe.thermalcorrener: 0.201402 hartree
zpe.thermalcorrenthalpy: 0.202346 hartree
zpe.thermalcorrgfe: 0.155854 hartree
zpe.sumelectzpe: -536.864198 hartree
zpe.sumelectthermal: -536.854561 hartree
zpe.sumelectthermalent: -536.853616 hartree
zpe.sumelectthermalfe: -536.900108 hartree
dipole: 0.2841 -1.8876 2.1914
dipole: 2.9062
quadrupole: -64.8376 -65.2956 -67.4796
quadrupole: 4.6174 2.1651 4.0809
quadrupole: 1.0333 0.5753 -1.6087 4.6174 2.1651 4.0809
hfenergy: -537.0559621 hartree
pointgroup: C01 [X(C8H12O3)]
dipole: -0.1246436 0.0000519 1.1365612 debye
dipolederiv: -0.5667326 -0.0259132 0.0451369 -0.0165377 -0.6444001 -0.0428272 -0.0269243 -0.0448493 -0.5313073 -0.6185802 -0.1833301 -0.4408963 -0.1875401 -0.510682 -0.2310791 -0.4176534 -0.211884 -0.8556392 -0.7844431 0.152724 0.2534624 -0.0074652 -0.4061159 -0.2108925 0.0684622 -0.2585332 -0.7467632 0.4962827 0.0823845 -0.0243541 0.1156249 0.3542769 0.0382338 0.0012734 0.1288044 0.3897003 0.4519021 -0.0538771 -0.0725314 -0.0135516 0.4777867 0.0299983 -0.0571593 -0.0507709 0.3178962 -0.3310239 0.0698884 0.0074943 0.1906396 0.0150411 -0.0741329 0.0743819 -0.0728364 0.0846157 -0.146252 -0.0094863 -0.0178995 -0.159365 0.0952771 0.0014282 0.0077454 -0.027888 0.0782928 -0.1109058 0.0285237 -0.0143363 0.0159979 0.0550614 -0.0206149 0.0453474 -0.0114632 0.0384945 0.0359121 -0.0977106 0.08458 -0.1059454 -0.0472404 0.0780004 0.0666014 0.0216225 -0.0302212 0.0665723 0.0101689 0.1098051 0.0316984 0.0107147 -0.0618408 0.1187714 -0.0042211 -0.1022861 1.4229487 -0.0256233 0.0768694 0.1039456 0.3930813 0.5127804 0.1357728 0.5323054 1.1974231 -0.0273044 0.0781857 -0.0055583 0.0529112 -0.1461307 0.0012294 -0.0053358 0.0241296 0.0553855 -0.0263221 -0.0576556 -0.0666596 -0.0500772 -0.0295038 -0.0777269 -0.0633376 -0.1035504 -0.0451529 0.0840063 -0.0193949 0.0304332 -0.0368087 0.0361312 0.0386605 0.0074878 0.0474579 -0.0926605 0.0458305 -0.0426342 -0.0562878 -0.0243254 -0.012177 -0.0732225 -0.0608607 -0.1205068 -0.04043 0.0150433 -0.0287893 0.0719971 -0.0031686 0.0261236 0.0473302 0.0826817 0.101764 -0.0534507 0.0446044 -0.0083843 0.070732 -0.0369139 0.0801163 0.0456747 0.0494453 0.0104158 -0.0637106 0.0566328 0.0504559 -0.0135278 0.0318423 -0.1584355 0.012428 -0.0339355 0.0547715 0.0679038 -0.1362102 0.0809184 0.0844871 0.0643387 0.0175574 -0.0444799 0.0366204 -0.0147734 0.06111 0.0252427 -0.0191668 -0.1335393 -0.0074353 0.0582927 0.0003209 -0.0937411 -0.0350331 -0.0935262 0.04194 0.0990711 -0.0779244 0.0568761 -0.0561506 0.0708865 -0.0504126 0.1002158 -0.0023761 -0.1631092 -0.0942692 0.0176137 -0.0518005 0.0310825 -0.0029598 -0.0135552 -0.0260232 0.0713868 0.1239655 0.0139145 0.0709034 0.03706 0.3602933 -0.0371949 0.1283244 -0.0391541 0.2953156 unknown
polarizability: 99.7605349|0.1539155|81.9942052|-1.7830797|7.8820593|81.0629389 unknown
InChI: InChI=1S/C8H12O3/c9-8(10)5-3-6-1-2-7(4-5)11-6/h5-7,9H,1-4H2
charge 0 multiplicity 1
23 atoms
O  -1.786662 0.483793 -1.169427
O  2.855699 0.291521 1.167544
O  2.860563 -0.722798 -0.919286
C  -1.367539 1.217993 0.054987
C  -1.53188 -0.931755 -0.778355
C  0.704431 -0.257251 0.228688
C  0.176904 1.213565 0.123334
C  -0.006043 -1.178829 -0.79426
C  -2.044568 0.423321 1.209773
C  -2.164468 -1.033186 0.641295
C  2.212488 -0.284081 0.05568
H  -1.750947 2.245425 -0.054632
H  -2.040314 -1.554239 -1.53181
H  0.500357 -0.608872 1.259194
H  0.537866 1.804612 0.984777
H  0.560778 1.683388 -0.80163
H  0.378366 -0.969514 -1.808274
H  0.214487 -2.240343 -0.572066
H  -3.041938 0.84177 1.423737
H  -1.453796 0.467411 2.14236
H  -1.645685 -1.777906 1.271336
H  -3.222114 -1.335491 0.564531
H  3.839319 0.287068 1.012404
